KDE CI: Extragear digikam kf5-qt5 SUSEQt5.9 - Build # 1 - Failure!

classic Classic list List threaded Threaded
420 messages Options
12345 ... 21
Reply | Threaded
Open this post in threaded view
|

KDE CI: Extragear digikam kf5-qt5 SUSEQt5.9 - Build # 21 - Still Failing!

no-reply
BUILD FAILURE
Build URL https://build.kde.org/job/Extragear%20digikam%20kf5-qt5%20SUSEQt5.9/21/
Project: Extragear digikam kf5-qt5 SUSEQt5.9
Date of build: Thu, 29 Jun 2017 10:15:19 +0000
Build duration: 2 min 15 sec and counting

CONSOLE OUTPUT
[...truncated 91.80 KB...]
'/usr/lib64/cmake/Qt5@module@/Qt5@[hidden email]'
Using the old result for compatibility since the policy is not set.
Call Stack (most recent call first):
/usr/lib64/cmake/Qt5/Qt5Config.cmake:25 (include)
CMakeLists.txt:130 (find_package)
This warning is for project developers. Use -Wno-dev to suppress it.
CMake Warning (dev) at /usr/lib64/cmake/Qt5/Qt5ModuleLocation.cmake:4 (set):
Policy CMP0053 is not set: Simplify variable reference and escape sequence
evaluation. Run "cmake --help-policy CMP0053" for policy details. Use the
cmake_policy command to set the policy and suppress this warning.
For input:
'${_qt5_install_prefix}/Qt5@module@/Qt5@[hidden email]'
the old evaluation rules produce:
'/usr/lib64/cmake/Qt5/Qt5Config.cmake'
but the new evaluation rules produce:
'/usr/lib64/cmake/Qt5@module@/Qt5@[hidden email]'
Using the old result for compatibility since the policy is not set.
Call Stack (most recent call first):
/usr/lib64/cmake/Qt5/Qt5Config.cmake:25 (include)
CMakeLists.txt:143 (find_package)
This warning is for project developers. Use -Wno-dev to suppress it.
-- Found KF5XmlGui: /home/jenkins/install-prefix/lib64/cmake/KF5XmlGui/KF5XmlGuiConfig.cmake (found version "5.36.0")
-- Found KF5CoreAddons: /home/jenkins/install-prefix/lib64/cmake/KF5CoreAddons/KF5CoreAddonsConfig.cmake (found version "5.36.0")
-- Found KF5Config: /home/jenkins/install-prefix/lib64/cmake/KF5Config/KF5ConfigConfig.cmake (found version "5.36.0")
-- Found KF5Service: /home/jenkins/install-prefix/lib64/cmake/KF5Service/KF5ServiceConfig.cmake (found version "5.36.0")
-- Found KF5WindowSystem: /home/jenkins/install-prefix/lib64/cmake/KF5WindowSystem/KF5WindowSystemConfig.cmake (found version "5.36.0")
-- Found KF5Solid: /home/jenkins/install-prefix/lib64/cmake/KF5Solid/KF5SolidConfig.cmake (found version "5.36.0")
-- Found Gettext: /usr/bin/msgmerge (found version "0.19.8.1")
-- Found PythonInterp: /usr/bin/python (found version "2.7.13")
-- Found KF5I18n: /home/jenkins/install-prefix/lib64/cmake/KF5I18n/KF5I18nConfig.cmake (found version "5.36.0")
-- Found KF5: success (found suitable version "5.36.0", minimum required is "5.1.0") found components: XmlGui CoreAddons Config Service WindowSystem Solid I18n
-- Found KF5KIO: /home/jenkins/install-prefix/lib64/cmake/KF5KIO/KF5KIOConfig.cmake (found version "5.36.0")
-- Found KF5IconThemes: /home/jenkins/install-prefix/lib64/cmake/KF5IconThemes/KF5IconThemesConfig.cmake (found version "5.36.0")
-- Found KF5FileMetaData: /home/jenkins/install-prefix/lib64/cmake/KF5FileMetaData/KF5FileMetaDataConfig.cmake (found version "5.36.0")
-- Found KF5ThreadWeaver: /home/jenkins/install-prefix/lib64/cmake/KF5ThreadWeaver/KF5ThreadWeaverConfig.cmake (found version "5.36.0")
-- Found KF5NotifyConfig: /home/jenkins/install-prefix/lib64/cmake/KF5NotifyConfig/KF5NotifyConfigConfig.cmake (found version "5.36.0")
-- Found KF5Notifications: /home/jenkins/install-prefix/lib64/cmake/KF5Notifications/KF5NotificationsConfig.cmake (found version "5.36.0")
-- Found KF5: success (found suitable version "5.36.0", minimum required is "5.1.0") found components: KIO IconThemes FileMetaData ThreadWeaver NotifyConfig Notifications
-- Boost version: 1.64.0
-- Found KF5AkonadiContact: /home/jenkins/install-prefix/lib64/cmake/KF5AkonadiContact/KF5AkonadiContactConfig.cmake (found version "5.5.60")
-- Found KF5: success (found suitable version "5.5.60", minimum required is "4.89.0") found components: AkonadiContact
-- Found Libical version 2.0
-- Found LibIcal: /usr/lib64/libical.so;/usr/lib64/libicalss.so (found suitable version "2.0", minimum required is "0.42")
-- Found KF5CalendarCore: /home/jenkins/install-prefix/lib64/cmake/KF5CalendarCore/KF5CalendarCoreConfig.cmake (found version "5.5.60")
-- Found KF5: success (found suitable version "5.5.60", minimum required is "4.81.0") found components: CalendarCore
-- KF5::KIOWidgets include dirs: /home/jenkins/install-prefix/include/KF5/KIOWidgets;/home/jenkins/install-prefix/include/KF5
-- Found JPEG: /usr/lib64/libjpeg.so
-- Libjpeg version: 62
-- Found TIFF: /usr/lib64/libtiff.so (found version "4.0.7")
-- Found ZLIB: /usr/lib64/libz.so (found version "1.2.11")
-- Found PNG: /usr/lib64/libpng.so (found version "1.6.29")
-- Boost version: 1.64.0
-- Found PkgConfig: /usr/bin/pkg-config (found version "0.29.2")
-- Checking for module 'lcms2'
-- Found lcms2, version 2.8
-- Found lcms version 2.08, /usr/lib64/liblcms2.so
-- Found EXPAT: /usr/lib64/libexpat.so (found version "2.2.0")
-- Looking for pthread.h
-- Looking for pthread.h - found
-- Looking for pthread_create
-- Looking for pthread_create - not found
-- Looking for pthread_create in pthreads
-- Looking for pthread_create in pthreads - not found
-- Looking for pthread_create in pthread
-- Looking for pthread_create in pthread - found
-- Found Threads: TRUE
CMake Error at /usr/share/cmake/Modules/FindPackageHandleStandardArgs.cmake:137 (message):
Could NOT find Exiv2: Found unsuitable version "0.25.0", but required is at
least "0.26" (found /usr/lib64/libexiv2.so)
Call Stack (most recent call first):
/usr/share/cmake/Modules/FindPackageHandleStandardArgs.cmake:375 (_FPHSA_FAILURE_MESSAGE)
cmake/modules/FindExiv2.cmake:73 (find_package_handle_standard_args)
CMakeLists.txt:212 (find_package)
-- Configuring incomplete, errors occurred!
See also "/home/jenkins/workspace/Extragear digikam kf5-qt5 SUSEQt5.9/build/CMakeFiles/CMakeOutput.log".
See also "/home/jenkins/workspace/Extragear digikam kf5-qt5 SUSEQt5.9/build/CMakeFiles/CMakeError.log".
[Pipeline] }
[Pipeline] // stage
[Pipeline] }
ERROR: script returned exit code 1
[Pipeline] // catchError
[Pipeline] sh
[Extragear digikam kf5-qt5 SUSEQt5.9] Running shell script
+ python3 -u ci-tooling/helpers/capture-workspace.py --environment production
[Pipeline] emailextrecipients
[Pipeline] emailext


build.log (19K) Download Attachment
Reply | Threaded
Open this post in threaded view
|

KDE CI: Extragear digikam kf5-qt5 SUSEQt5.9 - Build # 22 - Still Failing!

no-reply
BUILD FAILURE
Build URL https://build.kde.org/job/Extragear%20digikam%20kf5-qt5%20SUSEQt5.9/22/
Project: Extragear digikam kf5-qt5 SUSEQt5.9
Date of build: Thu, 29 Jun 2017 13:12:08 +0000
Build duration: 1 min 48 sec and counting

CONSOLE OUTPUT
[...truncated 91.94 KB...]
'/usr/lib64/cmake/Qt5@module@/Qt5@[hidden email]'
Using the old result for compatibility since the policy is not set.
Call Stack (most recent call first):
/usr/lib64/cmake/Qt5/Qt5Config.cmake:25 (include)
CMakeLists.txt:130 (find_package)
This warning is for project developers. Use -Wno-dev to suppress it.
CMake Warning (dev) at /usr/lib64/cmake/Qt5/Qt5ModuleLocation.cmake:4 (set):
Policy CMP0053 is not set: Simplify variable reference and escape sequence
evaluation. Run "cmake --help-policy CMP0053" for policy details. Use the
cmake_policy command to set the policy and suppress this warning.
For input:
'${_qt5_install_prefix}/Qt5@module@/Qt5@[hidden email]'
the old evaluation rules produce:
'/usr/lib64/cmake/Qt5/Qt5Config.cmake'
but the new evaluation rules produce:
'/usr/lib64/cmake/Qt5@module@/Qt5@[hidden email]'
Using the old result for compatibility since the policy is not set.
Call Stack (most recent call first):
/usr/lib64/cmake/Qt5/Qt5Config.cmake:25 (include)
CMakeLists.txt:143 (find_package)
This warning is for project developers. Use -Wno-dev to suppress it.
-- Found KF5XmlGui: /home/jenkins/install-prefix/lib64/cmake/KF5XmlGui/KF5XmlGuiConfig.cmake (found version "5.36.0")
-- Found KF5CoreAddons: /home/jenkins/install-prefix/lib64/cmake/KF5CoreAddons/KF5CoreAddonsConfig.cmake (found version "5.36.0")
-- Found KF5Config: /home/jenkins/install-prefix/lib64/cmake/KF5Config/KF5ConfigConfig.cmake (found version "5.36.0")
-- Found KF5Service: /home/jenkins/install-prefix/lib64/cmake/KF5Service/KF5ServiceConfig.cmake (found version "5.36.0")
-- Found KF5WindowSystem: /home/jenkins/install-prefix/lib64/cmake/KF5WindowSystem/KF5WindowSystemConfig.cmake (found version "5.36.0")
-- Found KF5Solid: /home/jenkins/install-prefix/lib64/cmake/KF5Solid/KF5SolidConfig.cmake (found version "5.36.0")
-- Found Gettext: /usr/bin/msgmerge (found version "0.19.8.1")
-- Found PythonInterp: /usr/bin/python (found version "2.7.13")
-- Found KF5I18n: /home/jenkins/install-prefix/lib64/cmake/KF5I18n/KF5I18nConfig.cmake (found version "5.36.0")
-- Found KF5: success (found suitable version "5.36.0", minimum required is "5.1.0") found components: XmlGui CoreAddons Config Service WindowSystem Solid I18n
-- Found KF5KIO: /home/jenkins/install-prefix/lib64/cmake/KF5KIO/KF5KIOConfig.cmake (found version "5.36.0")
-- Found KF5IconThemes: /home/jenkins/install-prefix/lib64/cmake/KF5IconThemes/KF5IconThemesConfig.cmake (found version "5.36.0")
-- Found KF5FileMetaData: /home/jenkins/install-prefix/lib64/cmake/KF5FileMetaData/KF5FileMetaDataConfig.cmake (found version "5.36.0")
-- Found KF5ThreadWeaver: /home/jenkins/install-prefix/lib64/cmake/KF5ThreadWeaver/KF5ThreadWeaverConfig.cmake (found version "5.36.0")
-- Found KF5NotifyConfig: /home/jenkins/install-prefix/lib64/cmake/KF5NotifyConfig/KF5NotifyConfigConfig.cmake (found version "5.36.0")
-- Found KF5Notifications: /home/jenkins/install-prefix/lib64/cmake/KF5Notifications/KF5NotificationsConfig.cmake (found version "5.36.0")
-- Found KF5: success (found suitable version "5.36.0", minimum required is "5.1.0") found components: KIO IconThemes FileMetaData ThreadWeaver NotifyConfig Notifications
-- Boost version: 1.64.0
-- Found KF5AkonadiContact: /home/jenkins/install-prefix/lib64/cmake/KF5AkonadiContact/KF5AkonadiContactConfig.cmake (found version "5.5.60")
-- Found KF5: success (found suitable version "5.5.60", minimum required is "4.89.0") found components: AkonadiContact
-- Found Libical version 2.0
-- Found LibIcal: /usr/lib64/libical.so;/usr/lib64/libicalss.so (found suitable version "2.0", minimum required is "0.42")
-- Found KF5CalendarCore: /home/jenkins/install-prefix/lib64/cmake/KF5CalendarCore/KF5CalendarCoreConfig.cmake (found version "5.5.60")
-- Found KF5: success (found suitable version "5.5.60", minimum required is "4.81.0") found components: CalendarCore
-- KF5::KIOWidgets include dirs: /home/jenkins/install-prefix/include/KF5/KIOWidgets;/home/jenkins/install-prefix/include/KF5
-- Found JPEG: /usr/lib64/libjpeg.so
-- Libjpeg version: 62
-- Found TIFF: /usr/lib64/libtiff.so (found version "4.0.7")
-- Found ZLIB: /usr/lib64/libz.so (found version "1.2.11")
-- Found PNG: /usr/lib64/libpng.so (found version "1.6.29")
-- Boost version: 1.64.0
-- Found PkgConfig: /usr/bin/pkg-config (found version "0.29.2")
-- Checking for module 'lcms2'
-- Found lcms2, version 2.8
-- Found lcms version 2.08, /usr/lib64/liblcms2.so
-- Found EXPAT: /usr/lib64/libexpat.so (found version "2.2.0")
-- Looking for pthread.h
-- Looking for pthread.h - found
-- Looking for pthread_create
-- Looking for pthread_create - not found
-- Looking for pthread_create in pthreads
-- Looking for pthread_create in pthreads - not found
-- Looking for pthread_create in pthread
-- Looking for pthread_create in pthread - found
-- Found Threads: TRUE
CMake Error at /usr/share/cmake/Modules/FindPackageHandleStandardArgs.cmake:137 (message):
Could NOT find Exiv2: Found unsuitable version "0.25.0", but required is at
least "0.26" (found /usr/lib64/libexiv2.so)
Call Stack (most recent call first):
/usr/share/cmake/Modules/FindPackageHandleStandardArgs.cmake:375 (_FPHSA_FAILURE_MESSAGE)
cmake/modules/FindExiv2.cmake:73 (find_package_handle_standard_args)
CMakeLists.txt:212 (find_package)
-- Configuring incomplete, errors occurred!
See also "/home/jenkins/workspace/Extragear digikam kf5-qt5 SUSEQt5.9/build/CMakeFiles/CMakeOutput.log".
See also "/home/jenkins/workspace/Extragear digikam kf5-qt5 SUSEQt5.9/build/CMakeFiles/CMakeError.log".
[Pipeline] }
[Pipeline] // stage
[Pipeline] }
ERROR: script returned exit code 1
[Pipeline] // catchError
[Pipeline] sh
[Extragear digikam kf5-qt5 SUSEQt5.9] Running shell script
+ python3 -u ci-tooling/helpers/capture-workspace.py --environment production
[Pipeline] emailextrecipients
[Pipeline] emailext


build.log (25K) Download Attachment
Reply | Threaded
Open this post in threaded view
|

KDE CI: Extragear digikam kf5-qt5 SUSEQt5.9 - Build # 23 - Still Failing!

no-reply
BUILD FAILURE
Build URL https://build.kde.org/job/Extragear%20digikam%20kf5-qt5%20SUSEQt5.9/23/
Project: Extragear digikam kf5-qt5 SUSEQt5.9
Date of build: Thu, 29 Jun 2017 13:16:19 +0000
Build duration: 1 min 42 sec and counting

CONSOLE OUTPUT
[...truncated 91.96 KB...]
'/usr/lib64/cmake/Qt5@module@/Qt5@[hidden email]'
Using the old result for compatibility since the policy is not set.
Call Stack (most recent call first):
/usr/lib64/cmake/Qt5/Qt5Config.cmake:25 (include)
CMakeLists.txt:130 (find_package)
This warning is for project developers. Use -Wno-dev to suppress it.
CMake Warning (dev) at /usr/lib64/cmake/Qt5/Qt5ModuleLocation.cmake:4 (set):
Policy CMP0053 is not set: Simplify variable reference and escape sequence
evaluation. Run "cmake --help-policy CMP0053" for policy details. Use the
cmake_policy command to set the policy and suppress this warning.
For input:
'${_qt5_install_prefix}/Qt5@module@/Qt5@[hidden email]'
the old evaluation rules produce:
'/usr/lib64/cmake/Qt5/Qt5Config.cmake'
but the new evaluation rules produce:
'/usr/lib64/cmake/Qt5@module@/Qt5@[hidden email]'
Using the old result for compatibility since the policy is not set.
Call Stack (most recent call first):
/usr/lib64/cmake/Qt5/Qt5Config.cmake:25 (include)
CMakeLists.txt:143 (find_package)
This warning is for project developers. Use -Wno-dev to suppress it.
-- Found KF5XmlGui: /home/jenkins/install-prefix/lib64/cmake/KF5XmlGui/KF5XmlGuiConfig.cmake (found version "5.36.0")
-- Found KF5CoreAddons: /home/jenkins/install-prefix/lib64/cmake/KF5CoreAddons/KF5CoreAddonsConfig.cmake (found version "5.36.0")
-- Found KF5Config: /home/jenkins/install-prefix/lib64/cmake/KF5Config/KF5ConfigConfig.cmake (found version "5.36.0")
-- Found KF5Service: /home/jenkins/install-prefix/lib64/cmake/KF5Service/KF5ServiceConfig.cmake (found version "5.36.0")
-- Found KF5WindowSystem: /home/jenkins/install-prefix/lib64/cmake/KF5WindowSystem/KF5WindowSystemConfig.cmake (found version "5.36.0")
-- Found KF5Solid: /home/jenkins/install-prefix/lib64/cmake/KF5Solid/KF5SolidConfig.cmake (found version "5.36.0")
-- Found Gettext: /usr/bin/msgmerge (found version "0.19.8.1")
-- Found PythonInterp: /usr/bin/python (found version "2.7.13")
-- Found KF5I18n: /home/jenkins/install-prefix/lib64/cmake/KF5I18n/KF5I18nConfig.cmake (found version "5.36.0")
-- Found KF5: success (found suitable version "5.36.0", minimum required is "5.1.0") found components: XmlGui CoreAddons Config Service WindowSystem Solid I18n
-- Found KF5KIO: /home/jenkins/install-prefix/lib64/cmake/KF5KIO/KF5KIOConfig.cmake (found version "5.36.0")
-- Found KF5IconThemes: /home/jenkins/install-prefix/lib64/cmake/KF5IconThemes/KF5IconThemesConfig.cmake (found version "5.36.0")
-- Found KF5FileMetaData: /home/jenkins/install-prefix/lib64/cmake/KF5FileMetaData/KF5FileMetaDataConfig.cmake (found version "5.36.0")
-- Found KF5ThreadWeaver: /home/jenkins/install-prefix/lib64/cmake/KF5ThreadWeaver/KF5ThreadWeaverConfig.cmake (found version "5.36.0")
-- Found KF5NotifyConfig: /home/jenkins/install-prefix/lib64/cmake/KF5NotifyConfig/KF5NotifyConfigConfig.cmake (found version "5.36.0")
-- Found KF5Notifications: /home/jenkins/install-prefix/lib64/cmake/KF5Notifications/KF5NotificationsConfig.cmake (found version "5.36.0")
-- Found KF5: success (found suitable version "5.36.0", minimum required is "5.1.0") found components: KIO IconThemes FileMetaData ThreadWeaver NotifyConfig Notifications
-- Boost version: 1.64.0
-- Found KF5AkonadiContact: /home/jenkins/install-prefix/lib64/cmake/KF5AkonadiContact/KF5AkonadiContactConfig.cmake (found version "5.5.60")
-- Found KF5: success (found suitable version "5.5.60", minimum required is "4.89.0") found components: AkonadiContact
-- Found Libical version 2.0
-- Found LibIcal: /usr/lib64/libical.so;/usr/lib64/libicalss.so (found suitable version "2.0", minimum required is "0.42")
-- Found KF5CalendarCore: /home/jenkins/install-prefix/lib64/cmake/KF5CalendarCore/KF5CalendarCoreConfig.cmake (found version "5.5.60")
-- Found KF5: success (found suitable version "5.5.60", minimum required is "4.81.0") found components: CalendarCore
-- KF5::KIOWidgets include dirs: /home/jenkins/install-prefix/include/KF5/KIOWidgets;/home/jenkins/install-prefix/include/KF5
-- Found JPEG: /usr/lib64/libjpeg.so
-- Libjpeg version: 62
-- Found TIFF: /usr/lib64/libtiff.so (found version "4.0.7")
-- Found ZLIB: /usr/lib64/libz.so (found version "1.2.11")
-- Found PNG: /usr/lib64/libpng.so (found version "1.6.29")
-- Boost version: 1.64.0
-- Found PkgConfig: /usr/bin/pkg-config (found version "0.29.2")
-- Checking for module 'lcms2'
-- Found lcms2, version 2.8
-- Found lcms version 2.08, /usr/lib64/liblcms2.so
-- Found EXPAT: /usr/lib64/libexpat.so (found version "2.2.0")
-- Looking for pthread.h
-- Looking for pthread.h - found
-- Looking for pthread_create
-- Looking for pthread_create - not found
-- Looking for pthread_create in pthreads
-- Looking for pthread_create in pthreads - not found
-- Looking for pthread_create in pthread
-- Looking for pthread_create in pthread - found
-- Found Threads: TRUE
CMake Error at /usr/share/cmake/Modules/FindPackageHandleStandardArgs.cmake:137 (message):
Could NOT find Exiv2: Found unsuitable version "0.25.0", but required is at
least "0.26" (found /usr/lib64/libexiv2.so)
Call Stack (most recent call first):
/usr/share/cmake/Modules/FindPackageHandleStandardArgs.cmake:375 (_FPHSA_FAILURE_MESSAGE)
cmake/modules/FindExiv2.cmake:73 (find_package_handle_standard_args)
CMakeLists.txt:212 (find_package)
-- Configuring incomplete, errors occurred!
See also "/home/jenkins/workspace/Extragear digikam kf5-qt5 SUSEQt5.9/build/CMakeFiles/CMakeOutput.log".
See also "/home/jenkins/workspace/Extragear digikam kf5-qt5 SUSEQt5.9/build/CMakeFiles/CMakeError.log".
[Pipeline] }
[Pipeline] // stage
[Pipeline] }
ERROR: script returned exit code 1
[Pipeline] // catchError
[Pipeline] sh
[Extragear digikam kf5-qt5 SUSEQt5.9] Running shell script
+ python3 -u ci-tooling/helpers/capture-workspace.py --environment production
[Pipeline] emailextrecipients
[Pipeline] emailext


build.log (19K) Download Attachment
Reply | Threaded
Open this post in threaded view
|

KDE CI: Extragear digikam kf5-qt5 SUSEQt5.9 - Build # 24 - Still Failing!

no-reply
BUILD FAILURE
Build URL https://build.kde.org/job/Extragear%20digikam%20kf5-qt5%20SUSEQt5.9/24/
Project: Extragear digikam kf5-qt5 SUSEQt5.9
Date of build: Thu, 29 Jun 2017 13:18:06 +0000
Build duration: 1 min 22 sec and counting

CONSOLE OUTPUT
[...truncated 91.66 KB...]
'/usr/lib64/cmake/Qt5@module@/Qt5@[hidden email]'
Using the old result for compatibility since the policy is not set.
Call Stack (most recent call first):
/usr/lib64/cmake/Qt5/Qt5Config.cmake:25 (include)
CMakeLists.txt:130 (find_package)
This warning is for project developers. Use -Wno-dev to suppress it.
CMake Warning (dev) at /usr/lib64/cmake/Qt5/Qt5ModuleLocation.cmake:4 (set):
Policy CMP0053 is not set: Simplify variable reference and escape sequence
evaluation. Run "cmake --help-policy CMP0053" for policy details. Use the
cmake_policy command to set the policy and suppress this warning.
For input:
'${_qt5_install_prefix}/Qt5@module@/Qt5@[hidden email]'
the old evaluation rules produce:
'/usr/lib64/cmake/Qt5/Qt5Config.cmake'
but the new evaluation rules produce:
'/usr/lib64/cmake/Qt5@module@/Qt5@[hidden email]'
Using the old result for compatibility since the policy is not set.
Call Stack (most recent call first):
/usr/lib64/cmake/Qt5/Qt5Config.cmake:25 (include)
CMakeLists.txt:143 (find_package)
This warning is for project developers. Use -Wno-dev to suppress it.
-- Found KF5XmlGui: /home/jenkins/install-prefix/lib64/cmake/KF5XmlGui/KF5XmlGuiConfig.cmake (found version "5.36.0")
-- Found KF5CoreAddons: /home/jenkins/install-prefix/lib64/cmake/KF5CoreAddons/KF5CoreAddonsConfig.cmake (found version "5.36.0")
-- Found KF5Config: /home/jenkins/install-prefix/lib64/cmake/KF5Config/KF5ConfigConfig.cmake (found version "5.36.0")
-- Found KF5Service: /home/jenkins/install-prefix/lib64/cmake/KF5Service/KF5ServiceConfig.cmake (found version "5.36.0")
-- Found KF5WindowSystem: /home/jenkins/install-prefix/lib64/cmake/KF5WindowSystem/KF5WindowSystemConfig.cmake (found version "5.36.0")
-- Found KF5Solid: /home/jenkins/install-prefix/lib64/cmake/KF5Solid/KF5SolidConfig.cmake (found version "5.36.0")
-- Found Gettext: /usr/bin/msgmerge (found version "0.19.8.1")
-- Found PythonInterp: /usr/bin/python (found version "2.7.13")
-- Found KF5I18n: /home/jenkins/install-prefix/lib64/cmake/KF5I18n/KF5I18nConfig.cmake (found version "5.36.0")
-- Found KF5: success (found suitable version "5.36.0", minimum required is "5.1.0") found components: XmlGui CoreAddons Config Service WindowSystem Solid I18n
-- Found KF5KIO: /home/jenkins/install-prefix/lib64/cmake/KF5KIO/KF5KIOConfig.cmake (found version "5.36.0")
-- Found KF5IconThemes: /home/jenkins/install-prefix/lib64/cmake/KF5IconThemes/KF5IconThemesConfig.cmake (found version "5.36.0")
-- Found KF5FileMetaData: /home/jenkins/install-prefix/lib64/cmake/KF5FileMetaData/KF5FileMetaDataConfig.cmake (found version "5.36.0")
-- Found KF5ThreadWeaver: /home/jenkins/install-prefix/lib64/cmake/KF5ThreadWeaver/KF5ThreadWeaverConfig.cmake (found version "5.36.0")
-- Found KF5NotifyConfig: /home/jenkins/install-prefix/lib64/cmake/KF5NotifyConfig/KF5NotifyConfigConfig.cmake (found version "5.36.0")
-- Found KF5Notifications: /home/jenkins/install-prefix/lib64/cmake/KF5Notifications/KF5NotificationsConfig.cmake (found version "5.36.0")
-- Found KF5: success (found suitable version "5.36.0", minimum required is "5.1.0") found components: KIO IconThemes FileMetaData ThreadWeaver NotifyConfig Notifications
-- Boost version: 1.64.0
-- Found KF5AkonadiContact: /home/jenkins/install-prefix/lib64/cmake/KF5AkonadiContact/KF5AkonadiContactConfig.cmake (found version "5.5.60")
-- Found KF5: success (found suitable version "5.5.60", minimum required is "4.89.0") found components: AkonadiContact
-- Found Libical version 2.0
-- Found LibIcal: /usr/lib64/libical.so;/usr/lib64/libicalss.so (found suitable version "2.0", minimum required is "0.42")
-- Found KF5CalendarCore: /home/jenkins/install-prefix/lib64/cmake/KF5CalendarCore/KF5CalendarCoreConfig.cmake (found version "5.5.60")
-- Found KF5: success (found suitable version "5.5.60", minimum required is "4.81.0") found components: CalendarCore
-- KF5::KIOWidgets include dirs: /home/jenkins/install-prefix/include/KF5/KIOWidgets;/home/jenkins/install-prefix/include/KF5
-- Found JPEG: /usr/lib64/libjpeg.so
-- Libjpeg version: 62
-- Found TIFF: /usr/lib64/libtiff.so (found version "4.0.7")
-- Found ZLIB: /usr/lib64/libz.so (found version "1.2.11")
-- Found PNG: /usr/lib64/libpng.so (found version "1.6.29")
-- Boost version: 1.64.0
-- Found PkgConfig: /usr/bin/pkg-config (found version "0.29.2")
-- Checking for module 'lcms2'
-- Found lcms2, version 2.8
-- Found lcms version 2.08, /usr/lib64/liblcms2.so
-- Found EXPAT: /usr/lib64/libexpat.so (found version "2.2.0")
-- Looking for pthread.h
-- Looking for pthread.h - found
-- Looking for pthread_create
-- Looking for pthread_create - not found
-- Looking for pthread_create in pthreads
-- Looking for pthread_create in pthreads - not found
-- Looking for pthread_create in pthread
-- Looking for pthread_create in pthread - found
-- Found Threads: TRUE
CMake Error at /usr/share/cmake/Modules/FindPackageHandleStandardArgs.cmake:137 (message):
Could NOT find Exiv2: Found unsuitable version "0.25.0", but required is at
least "0.26" (found /usr/lib64/libexiv2.so)
Call Stack (most recent call first):
/usr/share/cmake/Modules/FindPackageHandleStandardArgs.cmake:375 (_FPHSA_FAILURE_MESSAGE)
cmake/modules/FindExiv2.cmake:73 (find_package_handle_standard_args)
CMakeLists.txt:212 (find_package)
-- Configuring incomplete, errors occurred!
See also "/home/jenkins/workspace/Extragear digikam kf5-qt5 SUSEQt5.9/build/CMakeFiles/CMakeOutput.log".
See also "/home/jenkins/workspace/Extragear digikam kf5-qt5 SUSEQt5.9/build/CMakeFiles/CMakeError.log".
[Pipeline] }
[Pipeline] // stage
[Pipeline] }
ERROR: script returned exit code 1
[Pipeline] // catchError
[Pipeline] sh
[Extragear digikam kf5-qt5 SUSEQt5.9] Running shell script
+ python3 -u ci-tooling/helpers/capture-workspace.py --environment production
[Pipeline] emailextrecipients
[Pipeline] emailext


build.log (26K) Download Attachment
Reply | Threaded
Open this post in threaded view
|

KDE CI: Extragear digikam kf5-qt5 SUSEQt5.9 - Build # 25 - Still Failing!

no-reply
BUILD FAILURE
Build URL https://build.kde.org/job/Extragear%20digikam%20kf5-qt5%20SUSEQt5.9/25/
Project: Extragear digikam kf5-qt5 SUSEQt5.9
Date of build: Thu, 29 Jun 2017 13:22:31 +0000
Build duration: 1 min 18 sec and counting

CONSOLE OUTPUT
[...truncated 91.34 KB...]
'/usr/lib64/cmake/Qt5@module@/Qt5@[hidden email]'
Using the old result for compatibility since the policy is not set.
Call Stack (most recent call first):
/usr/lib64/cmake/Qt5/Qt5Config.cmake:25 (include)
CMakeLists.txt:130 (find_package)
This warning is for project developers. Use -Wno-dev to suppress it.
CMake Warning (dev) at /usr/lib64/cmake/Qt5/Qt5ModuleLocation.cmake:4 (set):
Policy CMP0053 is not set: Simplify variable reference and escape sequence
evaluation. Run "cmake --help-policy CMP0053" for policy details. Use the
cmake_policy command to set the policy and suppress this warning.
For input:
'${_qt5_install_prefix}/Qt5@module@/Qt5@[hidden email]'
the old evaluation rules produce:
'/usr/lib64/cmake/Qt5/Qt5Config.cmake'
but the new evaluation rules produce:
'/usr/lib64/cmake/Qt5@module@/Qt5@[hidden email]'
Using the old result for compatibility since the policy is not set.
Call Stack (most recent call first):
/usr/lib64/cmake/Qt5/Qt5Config.cmake:25 (include)
CMakeLists.txt:143 (find_package)
This warning is for project developers. Use -Wno-dev to suppress it.
-- Found KF5XmlGui: /home/jenkins/install-prefix/lib64/cmake/KF5XmlGui/KF5XmlGuiConfig.cmake (found version "5.36.0")
-- Found KF5CoreAddons: /home/jenkins/install-prefix/lib64/cmake/KF5CoreAddons/KF5CoreAddonsConfig.cmake (found version "5.36.0")
-- Found KF5Config: /home/jenkins/install-prefix/lib64/cmake/KF5Config/KF5ConfigConfig.cmake (found version "5.36.0")
-- Found KF5Service: /home/jenkins/install-prefix/lib64/cmake/KF5Service/KF5ServiceConfig.cmake (found version "5.36.0")
-- Found KF5WindowSystem: /home/jenkins/install-prefix/lib64/cmake/KF5WindowSystem/KF5WindowSystemConfig.cmake (found version "5.36.0")
-- Found KF5Solid: /home/jenkins/install-prefix/lib64/cmake/KF5Solid/KF5SolidConfig.cmake (found version "5.36.0")
-- Found Gettext: /usr/bin/msgmerge (found version "0.19.8.1")
-- Found PythonInterp: /usr/bin/python (found version "2.7.13")
-- Found KF5I18n: /home/jenkins/install-prefix/lib64/cmake/KF5I18n/KF5I18nConfig.cmake (found version "5.36.0")
-- Found KF5: success (found suitable version "5.36.0", minimum required is "5.1.0") found components: XmlGui CoreAddons Config Service WindowSystem Solid I18n
-- Found KF5KIO: /home/jenkins/install-prefix/lib64/cmake/KF5KIO/KF5KIOConfig.cmake (found version "5.36.0")
-- Found KF5IconThemes: /home/jenkins/install-prefix/lib64/cmake/KF5IconThemes/KF5IconThemesConfig.cmake (found version "5.36.0")
-- Found KF5FileMetaData: /home/jenkins/install-prefix/lib64/cmake/KF5FileMetaData/KF5FileMetaDataConfig.cmake (found version "5.36.0")
-- Found KF5ThreadWeaver: /home/jenkins/install-prefix/lib64/cmake/KF5ThreadWeaver/KF5ThreadWeaverConfig.cmake (found version "5.36.0")
-- Found KF5NotifyConfig: /home/jenkins/install-prefix/lib64/cmake/KF5NotifyConfig/KF5NotifyConfigConfig.cmake (found version "5.36.0")
-- Found KF5Notifications: /home/jenkins/install-prefix/lib64/cmake/KF5Notifications/KF5NotificationsConfig.cmake (found version "5.36.0")
-- Found KF5: success (found suitable version "5.36.0", minimum required is "5.1.0") found components: KIO IconThemes FileMetaData ThreadWeaver NotifyConfig Notifications
-- Boost version: 1.64.0
-- Found KF5AkonadiContact: /home/jenkins/install-prefix/lib64/cmake/KF5AkonadiContact/KF5AkonadiContactConfig.cmake (found version "5.5.60")
-- Found KF5: success (found suitable version "5.5.60", minimum required is "4.89.0") found components: AkonadiContact
-- Found Libical version 2.0
-- Found LibIcal: /usr/lib64/libical.so;/usr/lib64/libicalss.so (found suitable version "2.0", minimum required is "0.42")
-- Found KF5CalendarCore: /home/jenkins/install-prefix/lib64/cmake/KF5CalendarCore/KF5CalendarCoreConfig.cmake (found version "5.5.60")
-- Found KF5: success (found suitable version "5.5.60", minimum required is "4.81.0") found components: CalendarCore
-- KF5::KIOWidgets include dirs: /home/jenkins/install-prefix/include/KF5/KIOWidgets;/home/jenkins/install-prefix/include/KF5
-- Found JPEG: /usr/lib64/libjpeg.so
-- Libjpeg version: 62
-- Found TIFF: /usr/lib64/libtiff.so (found version "4.0.7")
-- Found ZLIB: /usr/lib64/libz.so (found version "1.2.11")
-- Found PNG: /usr/lib64/libpng.so (found version "1.6.29")
-- Boost version: 1.64.0
-- Found PkgConfig: /usr/bin/pkg-config (found version "0.29.2")
-- Checking for module 'lcms2'
-- Found lcms2, version 2.8
-- Found lcms version 2.08, /usr/lib64/liblcms2.so
-- Found EXPAT: /usr/lib64/libexpat.so (found version "2.2.0")
-- Looking for pthread.h
-- Looking for pthread.h - found
-- Looking for pthread_create
-- Looking for pthread_create - not found
-- Looking for pthread_create in pthreads
-- Looking for pthread_create in pthreads - not found
-- Looking for pthread_create in pthread
-- Looking for pthread_create in pthread - found
-- Found Threads: TRUE
CMake Error at /usr/share/cmake/Modules/FindPackageHandleStandardArgs.cmake:137 (message):
Could NOT find Exiv2: Found unsuitable version "0.25.0", but required is at
least "0.26" (found /usr/lib64/libexiv2.so)
Call Stack (most recent call first):
/usr/share/cmake/Modules/FindPackageHandleStandardArgs.cmake:375 (_FPHSA_FAILURE_MESSAGE)
cmake/modules/FindExiv2.cmake:73 (find_package_handle_standard_args)
CMakeLists.txt:212 (find_package)
-- Configuring incomplete, errors occurred!
See also "/home/jenkins/workspace/Extragear digikam kf5-qt5 SUSEQt5.9/build/CMakeFiles/CMakeOutput.log".
See also "/home/jenkins/workspace/Extragear digikam kf5-qt5 SUSEQt5.9/build/CMakeFiles/CMakeError.log".
[Pipeline] }
[Pipeline] // stage
[Pipeline] }
ERROR: script returned exit code 1
[Pipeline] // catchError
[Pipeline] sh
[Extragear digikam kf5-qt5 SUSEQt5.9] Running shell script
+ python3 -u ci-tooling/helpers/capture-workspace.py --environment production
[Pipeline] emailextrecipients
[Pipeline] emailext


build.log (19K) Download Attachment
Reply | Threaded
Open this post in threaded view
|

KDE CI: Extragear digikam kf5-qt5 SUSEQt5.9 - Build # 26 - Still Failing!

no-reply
BUILD FAILURE
Build URL https://build.kde.org/job/Extragear%20digikam%20kf5-qt5%20SUSEQt5.9/26/
Project: Extragear digikam kf5-qt5 SUSEQt5.9
Date of build: Thu, 29 Jun 2017 13:23:51 +0000
Build duration: 1 min 23 sec and counting

CONSOLE OUTPUT
[...truncated 91.65 KB...]
'/usr/lib64/cmake/Qt5@module@/Qt5@[hidden email]'
Using the old result for compatibility since the policy is not set.
Call Stack (most recent call first):
/usr/lib64/cmake/Qt5/Qt5Config.cmake:25 (include)
CMakeLists.txt:130 (find_package)
This warning is for project developers. Use -Wno-dev to suppress it.
CMake Warning (dev) at /usr/lib64/cmake/Qt5/Qt5ModuleLocation.cmake:4 (set):
Policy CMP0053 is not set: Simplify variable reference and escape sequence
evaluation. Run "cmake --help-policy CMP0053" for policy details. Use the
cmake_policy command to set the policy and suppress this warning.
For input:
'${_qt5_install_prefix}/Qt5@module@/Qt5@[hidden email]'
the old evaluation rules produce:
'/usr/lib64/cmake/Qt5/Qt5Config.cmake'
but the new evaluation rules produce:
'/usr/lib64/cmake/Qt5@module@/Qt5@[hidden email]'
Using the old result for compatibility since the policy is not set.
Call Stack (most recent call first):
/usr/lib64/cmake/Qt5/Qt5Config.cmake:25 (include)
CMakeLists.txt:143 (find_package)
This warning is for project developers. Use -Wno-dev to suppress it.
-- Found KF5XmlGui: /home/jenkins/install-prefix/lib64/cmake/KF5XmlGui/KF5XmlGuiConfig.cmake (found version "5.36.0")
-- Found KF5CoreAddons: /home/jenkins/install-prefix/lib64/cmake/KF5CoreAddons/KF5CoreAddonsConfig.cmake (found version "5.36.0")
-- Found KF5Config: /home/jenkins/install-prefix/lib64/cmake/KF5Config/KF5ConfigConfig.cmake (found version "5.36.0")
-- Found KF5Service: /home/jenkins/install-prefix/lib64/cmake/KF5Service/KF5ServiceConfig.cmake (found version "5.36.0")
-- Found KF5WindowSystem: /home/jenkins/install-prefix/lib64/cmake/KF5WindowSystem/KF5WindowSystemConfig.cmake (found version "5.36.0")
-- Found KF5Solid: /home/jenkins/install-prefix/lib64/cmake/KF5Solid/KF5SolidConfig.cmake (found version "5.36.0")
-- Found Gettext: /usr/bin/msgmerge (found version "0.19.8.1")
-- Found PythonInterp: /usr/bin/python (found version "2.7.13")
-- Found KF5I18n: /home/jenkins/install-prefix/lib64/cmake/KF5I18n/KF5I18nConfig.cmake (found version "5.36.0")
-- Found KF5: success (found suitable version "5.36.0", minimum required is "5.1.0") found components: XmlGui CoreAddons Config Service WindowSystem Solid I18n
-- Found KF5KIO: /home/jenkins/install-prefix/lib64/cmake/KF5KIO/KF5KIOConfig.cmake (found version "5.36.0")
-- Found KF5IconThemes: /home/jenkins/install-prefix/lib64/cmake/KF5IconThemes/KF5IconThemesConfig.cmake (found version "5.36.0")
-- Found KF5FileMetaData: /home/jenkins/install-prefix/lib64/cmake/KF5FileMetaData/KF5FileMetaDataConfig.cmake (found version "5.36.0")
-- Found KF5ThreadWeaver: /home/jenkins/install-prefix/lib64/cmake/KF5ThreadWeaver/KF5ThreadWeaverConfig.cmake (found version "5.36.0")
-- Found KF5NotifyConfig: /home/jenkins/install-prefix/lib64/cmake/KF5NotifyConfig/KF5NotifyConfigConfig.cmake (found version "5.36.0")
-- Found KF5Notifications: /home/jenkins/install-prefix/lib64/cmake/KF5Notifications/KF5NotificationsConfig.cmake (found version "5.36.0")
-- Found KF5: success (found suitable version "5.36.0", minimum required is "5.1.0") found components: KIO IconThemes FileMetaData ThreadWeaver NotifyConfig Notifications
-- Boost version: 1.64.0
-- Found KF5AkonadiContact: /home/jenkins/install-prefix/lib64/cmake/KF5AkonadiContact/KF5AkonadiContactConfig.cmake (found version "5.5.60")
-- Found KF5: success (found suitable version "5.5.60", minimum required is "4.89.0") found components: AkonadiContact
-- Found Libical version 2.0
-- Found LibIcal: /usr/lib64/libical.so;/usr/lib64/libicalss.so (found suitable version "2.0", minimum required is "0.42")
-- Found KF5CalendarCore: /home/jenkins/install-prefix/lib64/cmake/KF5CalendarCore/KF5CalendarCoreConfig.cmake (found version "5.5.60")
-- Found KF5: success (found suitable version "5.5.60", minimum required is "4.81.0") found components: CalendarCore
-- KF5::KIOWidgets include dirs: /home/jenkins/install-prefix/include/KF5/KIOWidgets;/home/jenkins/install-prefix/include/KF5
-- Found JPEG: /usr/lib64/libjpeg.so
-- Libjpeg version: 62
-- Found TIFF: /usr/lib64/libtiff.so (found version "4.0.7")
-- Found ZLIB: /usr/lib64/libz.so (found version "1.2.11")
-- Found PNG: /usr/lib64/libpng.so (found version "1.6.29")
-- Boost version: 1.64.0
-- Found PkgConfig: /usr/bin/pkg-config (found version "0.29.2")
-- Checking for module 'lcms2'
-- Found lcms2, version 2.8
-- Found lcms version 2.08, /usr/lib64/liblcms2.so
-- Found EXPAT: /usr/lib64/libexpat.so (found version "2.2.0")
-- Looking for pthread.h
-- Looking for pthread.h - found
-- Looking for pthread_create
-- Looking for pthread_create - not found
-- Looking for pthread_create in pthreads
-- Looking for pthread_create in pthreads - not found
-- Looking for pthread_create in pthread
-- Looking for pthread_create in pthread - found
-- Found Threads: TRUE
CMake Error at /usr/share/cmake/Modules/FindPackageHandleStandardArgs.cmake:137 (message):
Could NOT find Exiv2: Found unsuitable version "0.25.0", but required is at
least "0.26" (found /usr/lib64/libexiv2.so)
Call Stack (most recent call first):
/usr/share/cmake/Modules/FindPackageHandleStandardArgs.cmake:375 (_FPHSA_FAILURE_MESSAGE)
cmake/modules/FindExiv2.cmake:73 (find_package_handle_standard_args)
CMakeLists.txt:212 (find_package)
-- Configuring incomplete, errors occurred!
See also "/home/jenkins/workspace/Extragear digikam kf5-qt5 SUSEQt5.9/build/CMakeFiles/CMakeOutput.log".
See also "/home/jenkins/workspace/Extragear digikam kf5-qt5 SUSEQt5.9/build/CMakeFiles/CMakeError.log".
[Pipeline] }
[Pipeline] // stage
[Pipeline] }
ERROR: script returned exit code 1
[Pipeline] // catchError
[Pipeline] sh
[Extragear digikam kf5-qt5 SUSEQt5.9] Running shell script
+ python3 -u ci-tooling/helpers/capture-workspace.py --environment production
[Pipeline] emailextrecipients
[Pipeline] emailext


build.log (19K) Download Attachment
Reply | Threaded
Open this post in threaded view
|

KDE CI: Extragear digikam kf5-qt5 SUSEQt5.9 - Build # 27 - Still Failing!

no-reply
BUILD FAILURE
Build URL https://build.kde.org/job/Extragear%20digikam%20kf5-qt5%20SUSEQt5.9/27/
Project: Extragear digikam kf5-qt5 SUSEQt5.9
Date of build: Thu, 29 Jun 2017 13:25:37 +0000
Build duration: 1 min 13 sec and counting

CONSOLE OUTPUT
[...truncated 91.46 KB...]
'/usr/lib64/cmake/Qt5@module@/Qt5@[hidden email]'
Using the old result for compatibility since the policy is not set.
Call Stack (most recent call first):
/usr/lib64/cmake/Qt5/Qt5Config.cmake:25 (include)
CMakeLists.txt:130 (find_package)
This warning is for project developers. Use -Wno-dev to suppress it.
CMake Warning (dev) at /usr/lib64/cmake/Qt5/Qt5ModuleLocation.cmake:4 (set):
Policy CMP0053 is not set: Simplify variable reference and escape sequence
evaluation. Run "cmake --help-policy CMP0053" for policy details. Use the
cmake_policy command to set the policy and suppress this warning.
For input:
'${_qt5_install_prefix}/Qt5@module@/Qt5@[hidden email]'
the old evaluation rules produce:
'/usr/lib64/cmake/Qt5/Qt5Config.cmake'
but the new evaluation rules produce:
'/usr/lib64/cmake/Qt5@module@/Qt5@[hidden email]'
Using the old result for compatibility since the policy is not set.
Call Stack (most recent call first):
/usr/lib64/cmake/Qt5/Qt5Config.cmake:25 (include)
CMakeLists.txt:143 (find_package)
This warning is for project developers. Use -Wno-dev to suppress it.
-- Found KF5XmlGui: /home/jenkins/install-prefix/lib64/cmake/KF5XmlGui/KF5XmlGuiConfig.cmake (found version "5.36.0")
-- Found KF5CoreAddons: /home/jenkins/install-prefix/lib64/cmake/KF5CoreAddons/KF5CoreAddonsConfig.cmake (found version "5.36.0")
-- Found KF5Config: /home/jenkins/install-prefix/lib64/cmake/KF5Config/KF5ConfigConfig.cmake (found version "5.36.0")
-- Found KF5Service: /home/jenkins/install-prefix/lib64/cmake/KF5Service/KF5ServiceConfig.cmake (found version "5.36.0")
-- Found KF5WindowSystem: /home/jenkins/install-prefix/lib64/cmake/KF5WindowSystem/KF5WindowSystemConfig.cmake (found version "5.36.0")
-- Found KF5Solid: /home/jenkins/install-prefix/lib64/cmake/KF5Solid/KF5SolidConfig.cmake (found version "5.36.0")
-- Found Gettext: /usr/bin/msgmerge (found version "0.19.8.1")
-- Found PythonInterp: /usr/bin/python (found version "2.7.13")
-- Found KF5I18n: /home/jenkins/install-prefix/lib64/cmake/KF5I18n/KF5I18nConfig.cmake (found version "5.36.0")
-- Found KF5: success (found suitable version "5.36.0", minimum required is "5.1.0") found components: XmlGui CoreAddons Config Service WindowSystem Solid I18n
-- Found KF5KIO: /home/jenkins/install-prefix/lib64/cmake/KF5KIO/KF5KIOConfig.cmake (found version "5.36.0")
-- Found KF5IconThemes: /home/jenkins/install-prefix/lib64/cmake/KF5IconThemes/KF5IconThemesConfig.cmake (found version "5.36.0")
-- Found KF5FileMetaData: /home/jenkins/install-prefix/lib64/cmake/KF5FileMetaData/KF5FileMetaDataConfig.cmake (found version "5.36.0")
-- Found KF5ThreadWeaver: /home/jenkins/install-prefix/lib64/cmake/KF5ThreadWeaver/KF5ThreadWeaverConfig.cmake (found version "5.36.0")
-- Found KF5NotifyConfig: /home/jenkins/install-prefix/lib64/cmake/KF5NotifyConfig/KF5NotifyConfigConfig.cmake (found version "5.36.0")
-- Found KF5Notifications: /home/jenkins/install-prefix/lib64/cmake/KF5Notifications/KF5NotificationsConfig.cmake (found version "5.36.0")
-- Found KF5: success (found suitable version "5.36.0", minimum required is "5.1.0") found components: KIO IconThemes FileMetaData ThreadWeaver NotifyConfig Notifications
-- Boost version: 1.64.0
-- Found KF5AkonadiContact: /home/jenkins/install-prefix/lib64/cmake/KF5AkonadiContact/KF5AkonadiContactConfig.cmake (found version "5.5.60")
-- Found KF5: success (found suitable version "5.5.60", minimum required is "4.89.0") found components: AkonadiContact
-- Found Libical version 2.0
-- Found LibIcal: /usr/lib64/libical.so;/usr/lib64/libicalss.so (found suitable version "2.0", minimum required is "0.42")
-- Found KF5CalendarCore: /home/jenkins/install-prefix/lib64/cmake/KF5CalendarCore/KF5CalendarCoreConfig.cmake (found version "5.5.60")
-- Found KF5: success (found suitable version "5.5.60", minimum required is "4.81.0") found components: CalendarCore
-- KF5::KIOWidgets include dirs: /home/jenkins/install-prefix/include/KF5/KIOWidgets;/home/jenkins/install-prefix/include/KF5
-- Found JPEG: /usr/lib64/libjpeg.so
-- Libjpeg version: 62
-- Found TIFF: /usr/lib64/libtiff.so (found version "4.0.7")
-- Found ZLIB: /usr/lib64/libz.so (found version "1.2.11")
-- Found PNG: /usr/lib64/libpng.so (found version "1.6.29")
-- Boost version: 1.64.0
-- Found PkgConfig: /usr/bin/pkg-config (found version "0.29.2")
-- Checking for module 'lcms2'
-- Found lcms2, version 2.8
-- Found lcms version 2.08, /usr/lib64/liblcms2.so
-- Found EXPAT: /usr/lib64/libexpat.so (found version "2.2.0")
-- Looking for pthread.h
-- Looking for pthread.h - found
-- Looking for pthread_create
-- Looking for pthread_create - not found
-- Looking for pthread_create in pthreads
-- Looking for pthread_create in pthreads - not found
-- Looking for pthread_create in pthread
-- Looking for pthread_create in pthread - found
-- Found Threads: TRUE
CMake Error at /usr/share/cmake/Modules/FindPackageHandleStandardArgs.cmake:137 (message):
Could NOT find Exiv2: Found unsuitable version "0.25.0", but required is at
least "0.26" (found /usr/lib64/libexiv2.so)
Call Stack (most recent call first):
/usr/share/cmake/Modules/FindPackageHandleStandardArgs.cmake:375 (_FPHSA_FAILURE_MESSAGE)
cmake/modules/FindExiv2.cmake:73 (find_package_handle_standard_args)
CMakeLists.txt:212 (find_package)
-- Configuring incomplete, errors occurred!
See also "/home/jenkins/workspace/Extragear digikam kf5-qt5 SUSEQt5.9/build/CMakeFiles/CMakeOutput.log".
See also "/home/jenkins/workspace/Extragear digikam kf5-qt5 SUSEQt5.9/build/CMakeFiles/CMakeError.log".
[Pipeline] }
[Pipeline] // stage
[Pipeline] }
ERROR: script returned exit code 1
[Pipeline] // catchError
[Pipeline] sh
[Extragear digikam kf5-qt5 SUSEQt5.9] Running shell script
+ python3 -u ci-tooling/helpers/capture-workspace.py --environment production
[Pipeline] emailextrecipients
[Pipeline] emailext


build.log (19K) Download Attachment
Reply | Threaded
Open this post in threaded view
|

KDE CI: Extragear digikam kf5-qt5 SUSEQt5.9 - Build # 28 - Still Failing!

no-reply
BUILD FAILURE
Build URL https://build.kde.org/job/Extragear%20digikam%20kf5-qt5%20SUSEQt5.9/28/
Project: Extragear digikam kf5-qt5 SUSEQt5.9
Date of build: Thu, 29 Jun 2017 13:28:57 +0000
Build duration: 1 min 15 sec and counting

CONSOLE OUTPUT
[...truncated 91.28 KB...]
'/usr/lib64/cmake/Qt5@module@/Qt5@[hidden email]'
Using the old result for compatibility since the policy is not set.
Call Stack (most recent call first):
/usr/lib64/cmake/Qt5/Qt5Config.cmake:25 (include)
CMakeLists.txt:130 (find_package)
This warning is for project developers. Use -Wno-dev to suppress it.
CMake Warning (dev) at /usr/lib64/cmake/Qt5/Qt5ModuleLocation.cmake:4 (set):
Policy CMP0053 is not set: Simplify variable reference and escape sequence
evaluation. Run "cmake --help-policy CMP0053" for policy details. Use the
cmake_policy command to set the policy and suppress this warning.
For input:
'${_qt5_install_prefix}/Qt5@module@/Qt5@[hidden email]'
the old evaluation rules produce:
'/usr/lib64/cmake/Qt5/Qt5Config.cmake'
but the new evaluation rules produce:
'/usr/lib64/cmake/Qt5@module@/Qt5@[hidden email]'
Using the old result for compatibility since the policy is not set.
Call Stack (most recent call first):
/usr/lib64/cmake/Qt5/Qt5Config.cmake:25 (include)
CMakeLists.txt:143 (find_package)
This warning is for project developers. Use -Wno-dev to suppress it.
-- Found KF5XmlGui: /home/jenkins/install-prefix/lib64/cmake/KF5XmlGui/KF5XmlGuiConfig.cmake (found version "5.36.0")
-- Found KF5CoreAddons: /home/jenkins/install-prefix/lib64/cmake/KF5CoreAddons/KF5CoreAddonsConfig.cmake (found version "5.36.0")
-- Found KF5Config: /home/jenkins/install-prefix/lib64/cmake/KF5Config/KF5ConfigConfig.cmake (found version "5.36.0")
-- Found KF5Service: /home/jenkins/install-prefix/lib64/cmake/KF5Service/KF5ServiceConfig.cmake (found version "5.36.0")
-- Found KF5WindowSystem: /home/jenkins/install-prefix/lib64/cmake/KF5WindowSystem/KF5WindowSystemConfig.cmake (found version "5.36.0")
-- Found KF5Solid: /home/jenkins/install-prefix/lib64/cmake/KF5Solid/KF5SolidConfig.cmake (found version "5.36.0")
-- Found Gettext: /usr/bin/msgmerge (found version "0.19.8.1")
-- Found PythonInterp: /usr/bin/python (found version "2.7.13")
-- Found KF5I18n: /home/jenkins/install-prefix/lib64/cmake/KF5I18n/KF5I18nConfig.cmake (found version "5.36.0")
-- Found KF5: success (found suitable version "5.36.0", minimum required is "5.1.0") found components: XmlGui CoreAddons Config Service WindowSystem Solid I18n
-- Found KF5KIO: /home/jenkins/install-prefix/lib64/cmake/KF5KIO/KF5KIOConfig.cmake (found version "5.36.0")
-- Found KF5IconThemes: /home/jenkins/install-prefix/lib64/cmake/KF5IconThemes/KF5IconThemesConfig.cmake (found version "5.36.0")
-- Found KF5FileMetaData: /home/jenkins/install-prefix/lib64/cmake/KF5FileMetaData/KF5FileMetaDataConfig.cmake (found version "5.36.0")
-- Found KF5ThreadWeaver: /home/jenkins/install-prefix/lib64/cmake/KF5ThreadWeaver/KF5ThreadWeaverConfig.cmake (found version "5.36.0")
-- Found KF5NotifyConfig: /home/jenkins/install-prefix/lib64/cmake/KF5NotifyConfig/KF5NotifyConfigConfig.cmake (found version "5.36.0")
-- Found KF5Notifications: /home/jenkins/install-prefix/lib64/cmake/KF5Notifications/KF5NotificationsConfig.cmake (found version "5.36.0")
-- Found KF5: success (found suitable version "5.36.0", minimum required is "5.1.0") found components: KIO IconThemes FileMetaData ThreadWeaver NotifyConfig Notifications
-- Boost version: 1.64.0
-- Found KF5AkonadiContact: /home/jenkins/install-prefix/lib64/cmake/KF5AkonadiContact/KF5AkonadiContactConfig.cmake (found version "5.5.60")
-- Found KF5: success (found suitable version "5.5.60", minimum required is "4.89.0") found components: AkonadiContact
-- Found Libical version 2.0
-- Found LibIcal: /usr/lib64/libical.so;/usr/lib64/libicalss.so (found suitable version "2.0", minimum required is "0.42")
-- Found KF5CalendarCore: /home/jenkins/install-prefix/lib64/cmake/KF5CalendarCore/KF5CalendarCoreConfig.cmake (found version "5.5.60")
-- Found KF5: success (found suitable version "5.5.60", minimum required is "4.81.0") found components: CalendarCore
-- KF5::KIOWidgets include dirs: /home/jenkins/install-prefix/include/KF5/KIOWidgets;/home/jenkins/install-prefix/include/KF5
-- Found JPEG: /usr/lib64/libjpeg.so
-- Libjpeg version: 62
-- Found TIFF: /usr/lib64/libtiff.so (found version "4.0.7")
-- Found ZLIB: /usr/lib64/libz.so (found version "1.2.11")
-- Found PNG: /usr/lib64/libpng.so (found version "1.6.29")
-- Boost version: 1.64.0
-- Found PkgConfig: /usr/bin/pkg-config (found version "0.29.2")
-- Checking for module 'lcms2'
-- Found lcms2, version 2.8
-- Found lcms version 2.08, /usr/lib64/liblcms2.so
-- Found EXPAT: /usr/lib64/libexpat.so (found version "2.2.0")
-- Looking for pthread.h
-- Looking for pthread.h - found
-- Looking for pthread_create
-- Looking for pthread_create - not found
-- Looking for pthread_create in pthreads
-- Looking for pthread_create in pthreads - not found
-- Looking for pthread_create in pthread
-- Looking for pthread_create in pthread - found
-- Found Threads: TRUE
CMake Error at /usr/share/cmake/Modules/FindPackageHandleStandardArgs.cmake:137 (message):
Could NOT find Exiv2: Found unsuitable version "0.25.0", but required is at
least "0.26" (found /usr/lib64/libexiv2.so)
Call Stack (most recent call first):
/usr/share/cmake/Modules/FindPackageHandleStandardArgs.cmake:375 (_FPHSA_FAILURE_MESSAGE)
cmake/modules/FindExiv2.cmake:73 (find_package_handle_standard_args)
CMakeLists.txt:212 (find_package)
-- Configuring incomplete, errors occurred!
See also "/home/jenkins/workspace/Extragear digikam kf5-qt5 SUSEQt5.9/build/CMakeFiles/CMakeOutput.log".
See also "/home/jenkins/workspace/Extragear digikam kf5-qt5 SUSEQt5.9/build/CMakeFiles/CMakeError.log".
[Pipeline] }
[Pipeline] // stage
[Pipeline] }
ERROR: script returned exit code 1
[Pipeline] // catchError
[Pipeline] sh
[Extragear digikam kf5-qt5 SUSEQt5.9] Running shell script
+ python3 -u ci-tooling/helpers/capture-workspace.py --environment production
[Pipeline] emailextrecipients
[Pipeline] emailext


build.log (19K) Download Attachment
Reply | Threaded
Open this post in threaded view
|

KDE CI: Extragear digikam kf5-qt5 SUSEQt5.9 - Build # 29 - Still Failing!

no-reply
BUILD FAILURE
Build URL https://build.kde.org/job/Extragear%20digikam%20kf5-qt5%20SUSEQt5.9/29/
Project: Extragear digikam kf5-qt5 SUSEQt5.9
Date of build: Thu, 29 Jun 2017 13:32:12 +0000
Build duration: 1 min 21 sec and counting

CONSOLE OUTPUT
[...truncated 91.54 KB...]
'/usr/lib64/cmake/Qt5@module@/Qt5@[hidden email]'
Using the old result for compatibility since the policy is not set.
Call Stack (most recent call first):
/usr/lib64/cmake/Qt5/Qt5Config.cmake:25 (include)
CMakeLists.txt:130 (find_package)
This warning is for project developers. Use -Wno-dev to suppress it.
CMake Warning (dev) at /usr/lib64/cmake/Qt5/Qt5ModuleLocation.cmake:4 (set):
Policy CMP0053 is not set: Simplify variable reference and escape sequence
evaluation. Run "cmake --help-policy CMP0053" for policy details. Use the
cmake_policy command to set the policy and suppress this warning.
For input:
'${_qt5_install_prefix}/Qt5@module@/Qt5@[hidden email]'
the old evaluation rules produce:
'/usr/lib64/cmake/Qt5/Qt5Config.cmake'
but the new evaluation rules produce:
'/usr/lib64/cmake/Qt5@module@/Qt5@[hidden email]'
Using the old result for compatibility since the policy is not set.
Call Stack (most recent call first):
/usr/lib64/cmake/Qt5/Qt5Config.cmake:25 (include)
CMakeLists.txt:143 (find_package)
This warning is for project developers. Use -Wno-dev to suppress it.
-- Found KF5XmlGui: /home/jenkins/install-prefix/lib64/cmake/KF5XmlGui/KF5XmlGuiConfig.cmake (found version "5.36.0")
-- Found KF5CoreAddons: /home/jenkins/install-prefix/lib64/cmake/KF5CoreAddons/KF5CoreAddonsConfig.cmake (found version "5.36.0")
-- Found KF5Config: /home/jenkins/install-prefix/lib64/cmake/KF5Config/KF5ConfigConfig.cmake (found version "5.36.0")
-- Found KF5Service: /home/jenkins/install-prefix/lib64/cmake/KF5Service/KF5ServiceConfig.cmake (found version "5.36.0")
-- Found KF5WindowSystem: /home/jenkins/install-prefix/lib64/cmake/KF5WindowSystem/KF5WindowSystemConfig.cmake (found version "5.36.0")
-- Found KF5Solid: /home/jenkins/install-prefix/lib64/cmake/KF5Solid/KF5SolidConfig.cmake (found version "5.36.0")
-- Found Gettext: /usr/bin/msgmerge (found version "0.19.8.1")
-- Found PythonInterp: /usr/bin/python (found version "2.7.13")
-- Found KF5I18n: /home/jenkins/install-prefix/lib64/cmake/KF5I18n/KF5I18nConfig.cmake (found version "5.36.0")
-- Found KF5: success (found suitable version "5.36.0", minimum required is "5.1.0") found components: XmlGui CoreAddons Config Service WindowSystem Solid I18n
-- Found KF5KIO: /home/jenkins/install-prefix/lib64/cmake/KF5KIO/KF5KIOConfig.cmake (found version "5.36.0")
-- Found KF5IconThemes: /home/jenkins/install-prefix/lib64/cmake/KF5IconThemes/KF5IconThemesConfig.cmake (found version "5.36.0")
-- Found KF5FileMetaData: /home/jenkins/install-prefix/lib64/cmake/KF5FileMetaData/KF5FileMetaDataConfig.cmake (found version "5.36.0")
-- Found KF5ThreadWeaver: /home/jenkins/install-prefix/lib64/cmake/KF5ThreadWeaver/KF5ThreadWeaverConfig.cmake (found version "5.36.0")
-- Found KF5NotifyConfig: /home/jenkins/install-prefix/lib64/cmake/KF5NotifyConfig/KF5NotifyConfigConfig.cmake (found version "5.36.0")
-- Found KF5Notifications: /home/jenkins/install-prefix/lib64/cmake/KF5Notifications/KF5NotificationsConfig.cmake (found version "5.36.0")
-- Found KF5: success (found suitable version "5.36.0", minimum required is "5.1.0") found components: KIO IconThemes FileMetaData ThreadWeaver NotifyConfig Notifications
-- Boost version: 1.64.0
-- Found KF5AkonadiContact: /home/jenkins/install-prefix/lib64/cmake/KF5AkonadiContact/KF5AkonadiContactConfig.cmake (found version "5.5.60")
-- Found KF5: success (found suitable version "5.5.60", minimum required is "4.89.0") found components: AkonadiContact
-- Found Libical version 2.0
-- Found LibIcal: /usr/lib64/libical.so;/usr/lib64/libicalss.so (found suitable version "2.0", minimum required is "0.42")
-- Found KF5CalendarCore: /home/jenkins/install-prefix/lib64/cmake/KF5CalendarCore/KF5CalendarCoreConfig.cmake (found version "5.5.60")
-- Found KF5: success (found suitable version "5.5.60", minimum required is "4.81.0") found components: CalendarCore
-- KF5::KIOWidgets include dirs: /home/jenkins/install-prefix/include/KF5/KIOWidgets;/home/jenkins/install-prefix/include/KF5
-- Found JPEG: /usr/lib64/libjpeg.so
-- Libjpeg version: 62
-- Found TIFF: /usr/lib64/libtiff.so (found version "4.0.7")
-- Found ZLIB: /usr/lib64/libz.so (found version "1.2.11")
-- Found PNG: /usr/lib64/libpng.so (found version "1.6.29")
-- Boost version: 1.64.0
-- Found PkgConfig: /usr/bin/pkg-config (found version "0.29.2")
-- Checking for module 'lcms2'
-- Found lcms2, version 2.8
-- Found lcms version 2.08, /usr/lib64/liblcms2.so
-- Found EXPAT: /usr/lib64/libexpat.so (found version "2.2.0")
-- Looking for pthread.h
-- Looking for pthread.h - found
-- Looking for pthread_create
-- Looking for pthread_create - not found
-- Looking for pthread_create in pthreads
-- Looking for pthread_create in pthreads - not found
-- Looking for pthread_create in pthread
-- Looking for pthread_create in pthread - found
-- Found Threads: TRUE
CMake Error at /usr/share/cmake/Modules/FindPackageHandleStandardArgs.cmake:137 (message):
Could NOT find Exiv2: Found unsuitable version "0.25.0", but required is at
least "0.26" (found /usr/lib64/libexiv2.so)
Call Stack (most recent call first):
/usr/share/cmake/Modules/FindPackageHandleStandardArgs.cmake:375 (_FPHSA_FAILURE_MESSAGE)
cmake/modules/FindExiv2.cmake:73 (find_package_handle_standard_args)
CMakeLists.txt:212 (find_package)
-- Configuring incomplete, errors occurred!
See also "/home/jenkins/workspace/Extragear digikam kf5-qt5 SUSEQt5.9/build/CMakeFiles/CMakeOutput.log".
See also "/home/jenkins/workspace/Extragear digikam kf5-qt5 SUSEQt5.9/build/CMakeFiles/CMakeError.log".
[Pipeline] }
[Pipeline] // stage
[Pipeline] }
ERROR: script returned exit code 1
[Pipeline] // catchError
[Pipeline] sh
[Extragear digikam kf5-qt5 SUSEQt5.9] Running shell script
+ python3 -u ci-tooling/helpers/capture-workspace.py --environment production
[Pipeline] emailextrecipients
[Pipeline] emailext


build.log (19K) Download Attachment
Reply | Threaded
Open this post in threaded view
|

KDE CI: Extragear digikam kf5-qt5 SUSEQt5.9 - Build # 30 - Still Failing!

no-reply
BUILD FAILURE
Build URL https://build.kde.org/job/Extragear%20digikam%20kf5-qt5%20SUSEQt5.9/30/
Project: Extragear digikam kf5-qt5 SUSEQt5.9
Date of build: Thu, 29 Jun 2017 14:01:34 +0000
Build duration: 1 min 49 sec and counting

CONSOLE OUTPUT
[...truncated 92.06 KB...]
'/usr/lib64/cmake/Qt5@module@/Qt5@[hidden email]'
Using the old result for compatibility since the policy is not set.
Call Stack (most recent call first):
/usr/lib64/cmake/Qt5/Qt5Config.cmake:25 (include)
CMakeLists.txt:130 (find_package)
This warning is for project developers. Use -Wno-dev to suppress it.
CMake Warning (dev) at /usr/lib64/cmake/Qt5/Qt5ModuleLocation.cmake:4 (set):
Policy CMP0053 is not set: Simplify variable reference and escape sequence
evaluation. Run "cmake --help-policy CMP0053" for policy details. Use the
cmake_policy command to set the policy and suppress this warning.
For input:
'${_qt5_install_prefix}/Qt5@module@/Qt5@[hidden email]'
the old evaluation rules produce:
'/usr/lib64/cmake/Qt5/Qt5Config.cmake'
but the new evaluation rules produce:
'/usr/lib64/cmake/Qt5@module@/Qt5@[hidden email]'
Using the old result for compatibility since the policy is not set.
Call Stack (most recent call first):
/usr/lib64/cmake/Qt5/Qt5Config.cmake:25 (include)
CMakeLists.txt:143 (find_package)
This warning is for project developers. Use -Wno-dev to suppress it.
-- Found KF5XmlGui: /home/jenkins/install-prefix/lib64/cmake/KF5XmlGui/KF5XmlGuiConfig.cmake (found version "5.36.0")
-- Found KF5CoreAddons: /home/jenkins/install-prefix/lib64/cmake/KF5CoreAddons/KF5CoreAddonsConfig.cmake (found version "5.36.0")
-- Found KF5Config: /home/jenkins/install-prefix/lib64/cmake/KF5Config/KF5ConfigConfig.cmake (found version "5.36.0")
-- Found KF5Service: /home/jenkins/install-prefix/lib64/cmake/KF5Service/KF5ServiceConfig.cmake (found version "5.36.0")
-- Found KF5WindowSystem: /home/jenkins/install-prefix/lib64/cmake/KF5WindowSystem/KF5WindowSystemConfig.cmake (found version "5.36.0")
-- Found KF5Solid: /home/jenkins/install-prefix/lib64/cmake/KF5Solid/KF5SolidConfig.cmake (found version "5.36.0")
-- Found Gettext: /usr/bin/msgmerge (found version "0.19.8.1")
-- Found PythonInterp: /usr/bin/python (found version "2.7.13")
-- Found KF5I18n: /home/jenkins/install-prefix/lib64/cmake/KF5I18n/KF5I18nConfig.cmake (found version "5.36.0")
-- Found KF5: success (found suitable version "5.36.0", minimum required is "5.1.0") found components: XmlGui CoreAddons Config Service WindowSystem Solid I18n
-- Found KF5KIO: /home/jenkins/install-prefix/lib64/cmake/KF5KIO/KF5KIOConfig.cmake (found version "5.36.0")
-- Found KF5IconThemes: /home/jenkins/install-prefix/lib64/cmake/KF5IconThemes/KF5IconThemesConfig.cmake (found version "5.36.0")
-- Found KF5FileMetaData: /home/jenkins/install-prefix/lib64/cmake/KF5FileMetaData/KF5FileMetaDataConfig.cmake (found version "5.36.0")
-- Found KF5ThreadWeaver: /home/jenkins/install-prefix/lib64/cmake/KF5ThreadWeaver/KF5ThreadWeaverConfig.cmake (found version "5.36.0")
-- Found KF5NotifyConfig: /home/jenkins/install-prefix/lib64/cmake/KF5NotifyConfig/KF5NotifyConfigConfig.cmake (found version "5.36.0")
-- Found KF5Notifications: /home/jenkins/install-prefix/lib64/cmake/KF5Notifications/KF5NotificationsConfig.cmake (found version "5.36.0")
-- Found KF5: success (found suitable version "5.36.0", minimum required is "5.1.0") found components: KIO IconThemes FileMetaData ThreadWeaver NotifyConfig Notifications
-- Boost version: 1.64.0
-- Found KF5AkonadiContact: /home/jenkins/install-prefix/lib64/cmake/KF5AkonadiContact/KF5AkonadiContactConfig.cmake (found version "5.5.60")
-- Found KF5: success (found suitable version "5.5.60", minimum required is "4.89.0") found components: AkonadiContact
-- Found Libical version 2.0
-- Found LibIcal: /usr/lib64/libical.so;/usr/lib64/libicalss.so (found suitable version "2.0", minimum required is "0.42")
-- Found KF5CalendarCore: /home/jenkins/install-prefix/lib64/cmake/KF5CalendarCore/KF5CalendarCoreConfig.cmake (found version "5.5.60")
-- Found KF5: success (found suitable version "5.5.60", minimum required is "4.81.0") found components: CalendarCore
-- KF5::KIOWidgets include dirs: /home/jenkins/install-prefix/include/KF5/KIOWidgets;/home/jenkins/install-prefix/include/KF5
-- Found JPEG: /usr/lib64/libjpeg.so
-- Libjpeg version: 62
-- Found TIFF: /usr/lib64/libtiff.so (found version "4.0.7")
-- Found ZLIB: /usr/lib64/libz.so (found version "1.2.11")
-- Found PNG: /usr/lib64/libpng.so (found version "1.6.29")
-- Boost version: 1.64.0
-- Found PkgConfig: /usr/bin/pkg-config (found version "0.29.2")
-- Checking for module 'lcms2'
-- Found lcms2, version 2.8
-- Found lcms version 2.08, /usr/lib64/liblcms2.so
-- Found EXPAT: /usr/lib64/libexpat.so (found version "2.2.0")
-- Looking for pthread.h
-- Looking for pthread.h - found
-- Looking for pthread_create
-- Looking for pthread_create - not found
-- Looking for pthread_create in pthreads
-- Looking for pthread_create in pthreads - not found
-- Looking for pthread_create in pthread
-- Looking for pthread_create in pthread - found
-- Found Threads: TRUE
CMake Error at /usr/share/cmake/Modules/FindPackageHandleStandardArgs.cmake:137 (message):
Could NOT find Exiv2: Found unsuitable version "0.25.0", but required is at
least "0.26" (found /usr/lib64/libexiv2.so)
Call Stack (most recent call first):
/usr/share/cmake/Modules/FindPackageHandleStandardArgs.cmake:375 (_FPHSA_FAILURE_MESSAGE)
cmake/modules/FindExiv2.cmake:73 (find_package_handle_standard_args)
CMakeLists.txt:212 (find_package)
-- Configuring incomplete, errors occurred!
See also "/home/jenkins/workspace/Extragear digikam kf5-qt5 SUSEQt5.9/build/CMakeFiles/CMakeOutput.log".
See also "/home/jenkins/workspace/Extragear digikam kf5-qt5 SUSEQt5.9/build/CMakeFiles/CMakeError.log".
[Pipeline] }
[Pipeline] // stage
[Pipeline] }
ERROR: script returned exit code 1
[Pipeline] // catchError
[Pipeline] sh
[Extragear digikam kf5-qt5 SUSEQt5.9] Running shell script
+ python3 -u ci-tooling/helpers/capture-workspace.py --environment production
[Pipeline] emailextrecipients
[Pipeline] emailext


build.log (26K) Download Attachment
Reply | Threaded
Open this post in threaded view
|

KDE CI: Extragear digikam kf5-qt5 SUSEQt5.9 - Build # 31 - Still Failing!

no-reply
BUILD FAILURE
Build URL https://build.kde.org/job/Extragear%20digikam%20kf5-qt5%20SUSEQt5.9/31/
Project: Extragear digikam kf5-qt5 SUSEQt5.9
Date of build: Thu, 29 Jun 2017 14:08:59 +0000
Build duration: 1 min 18 sec and counting

CONSOLE OUTPUT
[...truncated 91.74 KB...]
'/usr/lib64/cmake/Qt5@module@/Qt5@[hidden email]'
Using the old result for compatibility since the policy is not set.
Call Stack (most recent call first):
/usr/lib64/cmake/Qt5/Qt5Config.cmake:25 (include)
CMakeLists.txt:130 (find_package)
This warning is for project developers. Use -Wno-dev to suppress it.
CMake Warning (dev) at /usr/lib64/cmake/Qt5/Qt5ModuleLocation.cmake:4 (set):
Policy CMP0053 is not set: Simplify variable reference and escape sequence
evaluation. Run "cmake --help-policy CMP0053" for policy details. Use the
cmake_policy command to set the policy and suppress this warning.
For input:
'${_qt5_install_prefix}/Qt5@module@/Qt5@[hidden email]'
the old evaluation rules produce:
'/usr/lib64/cmake/Qt5/Qt5Config.cmake'
but the new evaluation rules produce:
'/usr/lib64/cmake/Qt5@module@/Qt5@[hidden email]'
Using the old result for compatibility since the policy is not set.
Call Stack (most recent call first):
/usr/lib64/cmake/Qt5/Qt5Config.cmake:25 (include)
CMakeLists.txt:143 (find_package)
This warning is for project developers. Use -Wno-dev to suppress it.
-- Found KF5XmlGui: /home/jenkins/install-prefix/lib64/cmake/KF5XmlGui/KF5XmlGuiConfig.cmake (found version "5.36.0")
-- Found KF5CoreAddons: /home/jenkins/install-prefix/lib64/cmake/KF5CoreAddons/KF5CoreAddonsConfig.cmake (found version "5.36.0")
-- Found KF5Config: /home/jenkins/install-prefix/lib64/cmake/KF5Config/KF5ConfigConfig.cmake (found version "5.36.0")
-- Found KF5Service: /home/jenkins/install-prefix/lib64/cmake/KF5Service/KF5ServiceConfig.cmake (found version "5.36.0")
-- Found KF5WindowSystem: /home/jenkins/install-prefix/lib64/cmake/KF5WindowSystem/KF5WindowSystemConfig.cmake (found version "5.36.0")
-- Found KF5Solid: /home/jenkins/install-prefix/lib64/cmake/KF5Solid/KF5SolidConfig.cmake (found version "5.36.0")
-- Found Gettext: /usr/bin/msgmerge (found version "0.19.8.1")
-- Found PythonInterp: /usr/bin/python (found version "2.7.13")
-- Found KF5I18n: /home/jenkins/install-prefix/lib64/cmake/KF5I18n/KF5I18nConfig.cmake (found version "5.36.0")
-- Found KF5: success (found suitable version "5.36.0", minimum required is "5.1.0") found components: XmlGui CoreAddons Config Service WindowSystem Solid I18n
-- Found KF5KIO: /home/jenkins/install-prefix/lib64/cmake/KF5KIO/KF5KIOConfig.cmake (found version "5.36.0")
-- Found KF5IconThemes: /home/jenkins/install-prefix/lib64/cmake/KF5IconThemes/KF5IconThemesConfig.cmake (found version "5.36.0")
-- Found KF5FileMetaData: /home/jenkins/install-prefix/lib64/cmake/KF5FileMetaData/KF5FileMetaDataConfig.cmake (found version "5.36.0")
-- Found KF5ThreadWeaver: /home/jenkins/install-prefix/lib64/cmake/KF5ThreadWeaver/KF5ThreadWeaverConfig.cmake (found version "5.36.0")
-- Found KF5NotifyConfig: /home/jenkins/install-prefix/lib64/cmake/KF5NotifyConfig/KF5NotifyConfigConfig.cmake (found version "5.36.0")
-- Found KF5Notifications: /home/jenkins/install-prefix/lib64/cmake/KF5Notifications/KF5NotificationsConfig.cmake (found version "5.36.0")
-- Found KF5: success (found suitable version "5.36.0", minimum required is "5.1.0") found components: KIO IconThemes FileMetaData ThreadWeaver NotifyConfig Notifications
-- Boost version: 1.64.0
-- Found KF5AkonadiContact: /home/jenkins/install-prefix/lib64/cmake/KF5AkonadiContact/KF5AkonadiContactConfig.cmake (found version "5.5.60")
-- Found KF5: success (found suitable version "5.5.60", minimum required is "4.89.0") found components: AkonadiContact
-- Found Libical version 2.0
-- Found LibIcal: /usr/lib64/libical.so;/usr/lib64/libicalss.so (found suitable version "2.0", minimum required is "0.42")
-- Found KF5CalendarCore: /home/jenkins/install-prefix/lib64/cmake/KF5CalendarCore/KF5CalendarCoreConfig.cmake (found version "5.5.60")
-- Found KF5: success (found suitable version "5.5.60", minimum required is "4.81.0") found components: CalendarCore
-- KF5::KIOWidgets include dirs: /home/jenkins/install-prefix/include/KF5/KIOWidgets;/home/jenkins/install-prefix/include/KF5
-- Found JPEG: /usr/lib64/libjpeg.so
-- Libjpeg version: 62
-- Found TIFF: /usr/lib64/libtiff.so (found version "4.0.7")
-- Found ZLIB: /usr/lib64/libz.so (found version "1.2.11")
-- Found PNG: /usr/lib64/libpng.so (found version "1.6.29")
-- Boost version: 1.64.0
-- Found PkgConfig: /usr/bin/pkg-config (found version "0.29.2")
-- Checking for module 'lcms2'
-- Found lcms2, version 2.8
-- Found lcms version 2.08, /usr/lib64/liblcms2.so
-- Found EXPAT: /usr/lib64/libexpat.so (found version "2.2.0")
-- Looking for pthread.h
-- Looking for pthread.h - found
-- Looking for pthread_create
-- Looking for pthread_create - not found
-- Looking for pthread_create in pthreads
-- Looking for pthread_create in pthreads - not found
-- Looking for pthread_create in pthread
-- Looking for pthread_create in pthread - found
-- Found Threads: TRUE
CMake Error at /usr/share/cmake/Modules/FindPackageHandleStandardArgs.cmake:137 (message):
Could NOT find Exiv2: Found unsuitable version "0.25.0", but required is at
least "0.26" (found /usr/lib64/libexiv2.so)
Call Stack (most recent call first):
/usr/share/cmake/Modules/FindPackageHandleStandardArgs.cmake:375 (_FPHSA_FAILURE_MESSAGE)
cmake/modules/FindExiv2.cmake:73 (find_package_handle_standard_args)
CMakeLists.txt:212 (find_package)
-- Configuring incomplete, errors occurred!
See also "/home/jenkins/workspace/Extragear digikam kf5-qt5 SUSEQt5.9/build/CMakeFiles/CMakeOutput.log".
See also "/home/jenkins/workspace/Extragear digikam kf5-qt5 SUSEQt5.9/build/CMakeFiles/CMakeError.log".
[Pipeline] }
[Pipeline] // stage
[Pipeline] }
ERROR: script returned exit code 1
[Pipeline] // catchError
[Pipeline] sh
[Extragear digikam kf5-qt5 SUSEQt5.9] Running shell script
+ python3 -u ci-tooling/helpers/capture-workspace.py --environment production
[Pipeline] emailextrecipients
[Pipeline] emailext


build.log (19K) Download Attachment
Reply | Threaded
Open this post in threaded view
|

KDE CI: Extragear digikam kf5-qt5 SUSEQt5.9 - Build # 32 - Still Failing!

no-reply
BUILD FAILURE
Build URL https://build.kde.org/job/Extragear%20digikam%20kf5-qt5%20SUSEQt5.9/32/
Project: Extragear digikam kf5-qt5 SUSEQt5.9
Date of build: Thu, 29 Jun 2017 14:11:46 +0000
Build duration: 1 min 15 sec and counting

CONSOLE OUTPUT
[...truncated 91.05 KB...]
'/usr/lib64/cmake/Qt5@module@/Qt5@[hidden email]'
Using the old result for compatibility since the policy is not set.
Call Stack (most recent call first):
/usr/lib64/cmake/Qt5/Qt5Config.cmake:25 (include)
CMakeLists.txt:130 (find_package)
This warning is for project developers. Use -Wno-dev to suppress it.
CMake Warning (dev) at /usr/lib64/cmake/Qt5/Qt5ModuleLocation.cmake:4 (set):
Policy CMP0053 is not set: Simplify variable reference and escape sequence
evaluation. Run "cmake --help-policy CMP0053" for policy details. Use the
cmake_policy command to set the policy and suppress this warning.
For input:
'${_qt5_install_prefix}/Qt5@module@/Qt5@[hidden email]'
the old evaluation rules produce:
'/usr/lib64/cmake/Qt5/Qt5Config.cmake'
but the new evaluation rules produce:
'/usr/lib64/cmake/Qt5@module@/Qt5@[hidden email]'
Using the old result for compatibility since the policy is not set.
Call Stack (most recent call first):
/usr/lib64/cmake/Qt5/Qt5Config.cmake:25 (include)
CMakeLists.txt:143 (find_package)
This warning is for project developers. Use -Wno-dev to suppress it.
-- Found KF5XmlGui: /home/jenkins/install-prefix/lib64/cmake/KF5XmlGui/KF5XmlGuiConfig.cmake (found version "5.36.0")
-- Found KF5CoreAddons: /home/jenkins/install-prefix/lib64/cmake/KF5CoreAddons/KF5CoreAddonsConfig.cmake (found version "5.36.0")
-- Found KF5Config: /home/jenkins/install-prefix/lib64/cmake/KF5Config/KF5ConfigConfig.cmake (found version "5.36.0")
-- Found KF5Service: /home/jenkins/install-prefix/lib64/cmake/KF5Service/KF5ServiceConfig.cmake (found version "5.36.0")
-- Found KF5WindowSystem: /home/jenkins/install-prefix/lib64/cmake/KF5WindowSystem/KF5WindowSystemConfig.cmake (found version "5.36.0")
-- Found KF5Solid: /home/jenkins/install-prefix/lib64/cmake/KF5Solid/KF5SolidConfig.cmake (found version "5.36.0")
-- Found Gettext: /usr/bin/msgmerge (found version "0.19.8.1")
-- Found PythonInterp: /usr/bin/python (found version "2.7.13")
-- Found KF5I18n: /home/jenkins/install-prefix/lib64/cmake/KF5I18n/KF5I18nConfig.cmake (found version "5.36.0")
-- Found KF5: success (found suitable version "5.36.0", minimum required is "5.1.0") found components: XmlGui CoreAddons Config Service WindowSystem Solid I18n
-- Found KF5KIO: /home/jenkins/install-prefix/lib64/cmake/KF5KIO/KF5KIOConfig.cmake (found version "5.36.0")
-- Found KF5IconThemes: /home/jenkins/install-prefix/lib64/cmake/KF5IconThemes/KF5IconThemesConfig.cmake (found version "5.36.0")
-- Found KF5FileMetaData: /home/jenkins/install-prefix/lib64/cmake/KF5FileMetaData/KF5FileMetaDataConfig.cmake (found version "5.36.0")
-- Found KF5ThreadWeaver: /home/jenkins/install-prefix/lib64/cmake/KF5ThreadWeaver/KF5ThreadWeaverConfig.cmake (found version "5.36.0")
-- Found KF5NotifyConfig: /home/jenkins/install-prefix/lib64/cmake/KF5NotifyConfig/KF5NotifyConfigConfig.cmake (found version "5.36.0")
-- Found KF5Notifications: /home/jenkins/install-prefix/lib64/cmake/KF5Notifications/KF5NotificationsConfig.cmake (found version "5.36.0")
-- Found KF5: success (found suitable version "5.36.0", minimum required is "5.1.0") found components: KIO IconThemes FileMetaData ThreadWeaver NotifyConfig Notifications
-- Boost version: 1.64.0
-- Found KF5AkonadiContact: /home/jenkins/install-prefix/lib64/cmake/KF5AkonadiContact/KF5AkonadiContactConfig.cmake (found version "5.5.60")
-- Found KF5: success (found suitable version "5.5.60", minimum required is "4.89.0") found components: AkonadiContact
-- Found Libical version 2.0
-- Found LibIcal: /usr/lib64/libical.so;/usr/lib64/libicalss.so (found suitable version "2.0", minimum required is "0.42")
-- Found KF5CalendarCore: /home/jenkins/install-prefix/lib64/cmake/KF5CalendarCore/KF5CalendarCoreConfig.cmake (found version "5.5.60")
-- Found KF5: success (found suitable version "5.5.60", minimum required is "4.81.0") found components: CalendarCore
-- KF5::KIOWidgets include dirs: /home/jenkins/install-prefix/include/KF5/KIOWidgets;/home/jenkins/install-prefix/include/KF5
-- Found JPEG: /usr/lib64/libjpeg.so
-- Libjpeg version: 62
-- Found TIFF: /usr/lib64/libtiff.so (found version "4.0.7")
-- Found ZLIB: /usr/lib64/libz.so (found version "1.2.11")
-- Found PNG: /usr/lib64/libpng.so (found version "1.6.29")
-- Boost version: 1.64.0
-- Found PkgConfig: /usr/bin/pkg-config (found version "0.29.2")
-- Checking for module 'lcms2'
-- Found lcms2, version 2.8
-- Found lcms version 2.08, /usr/lib64/liblcms2.so
-- Found EXPAT: /usr/lib64/libexpat.so (found version "2.2.0")
-- Looking for pthread.h
-- Looking for pthread.h - found
-- Looking for pthread_create
-- Looking for pthread_create - not found
-- Looking for pthread_create in pthreads
-- Looking for pthread_create in pthreads - not found
-- Looking for pthread_create in pthread
-- Looking for pthread_create in pthread - found
-- Found Threads: TRUE
CMake Error at /usr/share/cmake/Modules/FindPackageHandleStandardArgs.cmake:137 (message):
Could NOT find Exiv2: Found unsuitable version "0.25.0", but required is at
least "0.26" (found /usr/lib64/libexiv2.so)
Call Stack (most recent call first):
/usr/share/cmake/Modules/FindPackageHandleStandardArgs.cmake:375 (_FPHSA_FAILURE_MESSAGE)
cmake/modules/FindExiv2.cmake:73 (find_package_handle_standard_args)
CMakeLists.txt:212 (find_package)
-- Configuring incomplete, errors occurred!
See also "/home/jenkins/workspace/Extragear digikam kf5-qt5 SUSEQt5.9/build/CMakeFiles/CMakeOutput.log".
See also "/home/jenkins/workspace/Extragear digikam kf5-qt5 SUSEQt5.9/build/CMakeFiles/CMakeError.log".
[Pipeline] }
[Pipeline] // stage
[Pipeline] }
ERROR: script returned exit code 1
[Pipeline] // catchError
[Pipeline] sh
[Extragear digikam kf5-qt5 SUSEQt5.9] Running shell script
+ python3 -u ci-tooling/helpers/capture-workspace.py --environment production
[Pipeline] emailextrecipients
[Pipeline] emailext


build.log (19K) Download Attachment
Reply | Threaded
Open this post in threaded view
|

KDE CI: Extragear digikam kf5-qt5 SUSEQt5.9 - Build # 33 - Still Failing!

no-reply
BUILD FAILURE
Build URL https://build.kde.org/job/Extragear%20digikam%20kf5-qt5%20SUSEQt5.9/33/
Project: Extragear digikam kf5-qt5 SUSEQt5.9
Date of build: Thu, 29 Jun 2017 14:35:13 +0000
Build duration: 1 min 20 sec and counting

CONSOLE OUTPUT
[...truncated 91.82 KB...]
'/usr/lib64/cmake/Qt5@module@/Qt5@[hidden email]'
Using the old result for compatibility since the policy is not set.
Call Stack (most recent call first):
/usr/lib64/cmake/Qt5/Qt5Config.cmake:25 (include)
CMakeLists.txt:130 (find_package)
This warning is for project developers. Use -Wno-dev to suppress it.
CMake Warning (dev) at /usr/lib64/cmake/Qt5/Qt5ModuleLocation.cmake:4 (set):
Policy CMP0053 is not set: Simplify variable reference and escape sequence
evaluation. Run "cmake --help-policy CMP0053" for policy details. Use the
cmake_policy command to set the policy and suppress this warning.
For input:
'${_qt5_install_prefix}/Qt5@module@/Qt5@[hidden email]'
the old evaluation rules produce:
'/usr/lib64/cmake/Qt5/Qt5Config.cmake'
but the new evaluation rules produce:
'/usr/lib64/cmake/Qt5@module@/Qt5@[hidden email]'
Using the old result for compatibility since the policy is not set.
Call Stack (most recent call first):
/usr/lib64/cmake/Qt5/Qt5Config.cmake:25 (include)
CMakeLists.txt:143 (find_package)
This warning is for project developers. Use -Wno-dev to suppress it.
-- Found KF5XmlGui: /home/jenkins/install-prefix/lib64/cmake/KF5XmlGui/KF5XmlGuiConfig.cmake (found version "5.36.0")
-- Found KF5CoreAddons: /home/jenkins/install-prefix/lib64/cmake/KF5CoreAddons/KF5CoreAddonsConfig.cmake (found version "5.36.0")
-- Found KF5Config: /home/jenkins/install-prefix/lib64/cmake/KF5Config/KF5ConfigConfig.cmake (found version "5.36.0")
-- Found KF5Service: /home/jenkins/install-prefix/lib64/cmake/KF5Service/KF5ServiceConfig.cmake (found version "5.36.0")
-- Found KF5WindowSystem: /home/jenkins/install-prefix/lib64/cmake/KF5WindowSystem/KF5WindowSystemConfig.cmake (found version "5.36.0")
-- Found KF5Solid: /home/jenkins/install-prefix/lib64/cmake/KF5Solid/KF5SolidConfig.cmake (found version "5.36.0")
-- Found Gettext: /usr/bin/msgmerge (found version "0.19.8.1")
-- Found PythonInterp: /usr/bin/python (found version "2.7.13")
-- Found KF5I18n: /home/jenkins/install-prefix/lib64/cmake/KF5I18n/KF5I18nConfig.cmake (found version "5.36.0")
-- Found KF5: success (found suitable version "5.36.0", minimum required is "5.1.0") found components: XmlGui CoreAddons Config Service WindowSystem Solid I18n
-- Found KF5KIO: /home/jenkins/install-prefix/lib64/cmake/KF5KIO/KF5KIOConfig.cmake (found version "5.36.0")
-- Found KF5IconThemes: /home/jenkins/install-prefix/lib64/cmake/KF5IconThemes/KF5IconThemesConfig.cmake (found version "5.36.0")
-- Found KF5FileMetaData: /home/jenkins/install-prefix/lib64/cmake/KF5FileMetaData/KF5FileMetaDataConfig.cmake (found version "5.36.0")
-- Found KF5ThreadWeaver: /home/jenkins/install-prefix/lib64/cmake/KF5ThreadWeaver/KF5ThreadWeaverConfig.cmake (found version "5.36.0")
-- Found KF5NotifyConfig: /home/jenkins/install-prefix/lib64/cmake/KF5NotifyConfig/KF5NotifyConfigConfig.cmake (found version "5.36.0")
-- Found KF5Notifications: /home/jenkins/install-prefix/lib64/cmake/KF5Notifications/KF5NotificationsConfig.cmake (found version "5.36.0")
-- Found KF5: success (found suitable version "5.36.0", minimum required is "5.1.0") found components: KIO IconThemes FileMetaData ThreadWeaver NotifyConfig Notifications
-- Boost version: 1.64.0
-- Found KF5AkonadiContact: /home/jenkins/install-prefix/lib64/cmake/KF5AkonadiContact/KF5AkonadiContactConfig.cmake (found version "5.5.60")
-- Found KF5: success (found suitable version "5.5.60", minimum required is "4.89.0") found components: AkonadiContact
-- Found Libical version 2.0
-- Found LibIcal: /usr/lib64/libical.so;/usr/lib64/libicalss.so (found suitable version "2.0", minimum required is "0.42")
-- Found KF5CalendarCore: /home/jenkins/install-prefix/lib64/cmake/KF5CalendarCore/KF5CalendarCoreConfig.cmake (found version "5.5.60")
-- Found KF5: success (found suitable version "5.5.60", minimum required is "4.81.0") found components: CalendarCore
-- KF5::KIOWidgets include dirs: /home/jenkins/install-prefix/include/KF5/KIOWidgets;/home/jenkins/install-prefix/include/KF5
-- Found JPEG: /usr/lib64/libjpeg.so
-- Libjpeg version: 62
-- Found TIFF: /usr/lib64/libtiff.so (found version "4.0.7")
-- Found ZLIB: /usr/lib64/libz.so (found version "1.2.11")
-- Found PNG: /usr/lib64/libpng.so (found version "1.6.29")
-- Boost version: 1.64.0
-- Found PkgConfig: /usr/bin/pkg-config (found version "0.29.2")
-- Checking for module 'lcms2'
-- Found lcms2, version 2.8
-- Found lcms version 2.08, /usr/lib64/liblcms2.so
-- Found EXPAT: /usr/lib64/libexpat.so (found version "2.2.0")
-- Looking for pthread.h
-- Looking for pthread.h - found
-- Looking for pthread_create
-- Looking for pthread_create - not found
-- Looking for pthread_create in pthreads
-- Looking for pthread_create in pthreads - not found
-- Looking for pthread_create in pthread
-- Looking for pthread_create in pthread - found
-- Found Threads: TRUE
CMake Error at /usr/share/cmake/Modules/FindPackageHandleStandardArgs.cmake:137 (message):
Could NOT find Exiv2: Found unsuitable version "0.25.0", but required is at
least "0.26" (found /usr/lib64/libexiv2.so)
Call Stack (most recent call first):
/usr/share/cmake/Modules/FindPackageHandleStandardArgs.cmake:375 (_FPHSA_FAILURE_MESSAGE)
cmake/modules/FindExiv2.cmake:73 (find_package_handle_standard_args)
CMakeLists.txt:212 (find_package)
-- Configuring incomplete, errors occurred!
See also "/home/jenkins/workspace/Extragear digikam kf5-qt5 SUSEQt5.9/build/CMakeFiles/CMakeOutput.log".
See also "/home/jenkins/workspace/Extragear digikam kf5-qt5 SUSEQt5.9/build/CMakeFiles/CMakeError.log".
[Pipeline] }
[Pipeline] // stage
[Pipeline] }
ERROR: script returned exit code 1
[Pipeline] // catchError
[Pipeline] sh
[Extragear digikam kf5-qt5 SUSEQt5.9] Running shell script
+ python3 -u ci-tooling/helpers/capture-workspace.py --environment production
[Pipeline] emailextrecipients
[Pipeline] emailext


build.log (19K) Download Attachment
Reply | Threaded
Open this post in threaded view
|

KDE CI: Extragear digikam kf5-qt5 SUSEQt5.9 - Build # 34 - Still Failing!

no-reply
BUILD FAILURE
Build URL https://build.kde.org/job/Extragear%20digikam%20kf5-qt5%20SUSEQt5.9/34/
Project: Extragear digikam kf5-qt5 SUSEQt5.9
Date of build: Thu, 29 Jun 2017 14:40:03 +0000
Build duration: 1 min 15 sec and counting

CONSOLE OUTPUT
[...truncated 91.33 KB...]
'/usr/lib64/cmake/Qt5@module@/Qt5@[hidden email]'
Using the old result for compatibility since the policy is not set.
Call Stack (most recent call first):
/usr/lib64/cmake/Qt5/Qt5Config.cmake:25 (include)
CMakeLists.txt:130 (find_package)
This warning is for project developers. Use -Wno-dev to suppress it.
CMake Warning (dev) at /usr/lib64/cmake/Qt5/Qt5ModuleLocation.cmake:4 (set):
Policy CMP0053 is not set: Simplify variable reference and escape sequence
evaluation. Run "cmake --help-policy CMP0053" for policy details. Use the
cmake_policy command to set the policy and suppress this warning.
For input:
'${_qt5_install_prefix}/Qt5@module@/Qt5@[hidden email]'
the old evaluation rules produce:
'/usr/lib64/cmake/Qt5/Qt5Config.cmake'
but the new evaluation rules produce:
'/usr/lib64/cmake/Qt5@module@/Qt5@[hidden email]'
Using the old result for compatibility since the policy is not set.
Call Stack (most recent call first):
/usr/lib64/cmake/Qt5/Qt5Config.cmake:25 (include)
CMakeLists.txt:143 (find_package)
This warning is for project developers. Use -Wno-dev to suppress it.
-- Found KF5XmlGui: /home/jenkins/install-prefix/lib64/cmake/KF5XmlGui/KF5XmlGuiConfig.cmake (found version "5.36.0")
-- Found KF5CoreAddons: /home/jenkins/install-prefix/lib64/cmake/KF5CoreAddons/KF5CoreAddonsConfig.cmake (found version "5.36.0")
-- Found KF5Config: /home/jenkins/install-prefix/lib64/cmake/KF5Config/KF5ConfigConfig.cmake (found version "5.36.0")
-- Found KF5Service: /home/jenkins/install-prefix/lib64/cmake/KF5Service/KF5ServiceConfig.cmake (found version "5.36.0")
-- Found KF5WindowSystem: /home/jenkins/install-prefix/lib64/cmake/KF5WindowSystem/KF5WindowSystemConfig.cmake (found version "5.36.0")
-- Found KF5Solid: /home/jenkins/install-prefix/lib64/cmake/KF5Solid/KF5SolidConfig.cmake (found version "5.36.0")
-- Found Gettext: /usr/bin/msgmerge (found version "0.19.8.1")
-- Found PythonInterp: /usr/bin/python (found version "2.7.13")
-- Found KF5I18n: /home/jenkins/install-prefix/lib64/cmake/KF5I18n/KF5I18nConfig.cmake (found version "5.36.0")
-- Found KF5: success (found suitable version "5.36.0", minimum required is "5.1.0") found components: XmlGui CoreAddons Config Service WindowSystem Solid I18n
-- Found KF5KIO: /home/jenkins/install-prefix/lib64/cmake/KF5KIO/KF5KIOConfig.cmake (found version "5.36.0")
-- Found KF5IconThemes: /home/jenkins/install-prefix/lib64/cmake/KF5IconThemes/KF5IconThemesConfig.cmake (found version "5.36.0")
-- Found KF5FileMetaData: /home/jenkins/install-prefix/lib64/cmake/KF5FileMetaData/KF5FileMetaDataConfig.cmake (found version "5.36.0")
-- Found KF5ThreadWeaver: /home/jenkins/install-prefix/lib64/cmake/KF5ThreadWeaver/KF5ThreadWeaverConfig.cmake (found version "5.36.0")
-- Found KF5NotifyConfig: /home/jenkins/install-prefix/lib64/cmake/KF5NotifyConfig/KF5NotifyConfigConfig.cmake (found version "5.36.0")
-- Found KF5Notifications: /home/jenkins/install-prefix/lib64/cmake/KF5Notifications/KF5NotificationsConfig.cmake (found version "5.36.0")
-- Found KF5: success (found suitable version "5.36.0", minimum required is "5.1.0") found components: KIO IconThemes FileMetaData ThreadWeaver NotifyConfig Notifications
-- Boost version: 1.64.0
-- Found KF5AkonadiContact: /home/jenkins/install-prefix/lib64/cmake/KF5AkonadiContact/KF5AkonadiContactConfig.cmake (found version "5.5.60")
-- Found KF5: success (found suitable version "5.5.60", minimum required is "4.89.0") found components: AkonadiContact
-- Found Libical version 2.0
-- Found LibIcal: /usr/lib64/libical.so;/usr/lib64/libicalss.so (found suitable version "2.0", minimum required is "0.42")
-- Found KF5CalendarCore: /home/jenkins/install-prefix/lib64/cmake/KF5CalendarCore/KF5CalendarCoreConfig.cmake (found version "5.5.60")
-- Found KF5: success (found suitable version "5.5.60", minimum required is "4.81.0") found components: CalendarCore
-- KF5::KIOWidgets include dirs: /home/jenkins/install-prefix/include/KF5/KIOWidgets;/home/jenkins/install-prefix/include/KF5
-- Found JPEG: /usr/lib64/libjpeg.so
-- Libjpeg version: 62
-- Found TIFF: /usr/lib64/libtiff.so (found version "4.0.7")
-- Found ZLIB: /usr/lib64/libz.so (found version "1.2.11")
-- Found PNG: /usr/lib64/libpng.so (found version "1.6.29")
-- Boost version: 1.64.0
-- Found PkgConfig: /usr/bin/pkg-config (found version "0.29.2")
-- Checking for module 'lcms2'
-- Found lcms2, version 2.8
-- Found lcms version 2.08, /usr/lib64/liblcms2.so
-- Found EXPAT: /usr/lib64/libexpat.so (found version "2.2.0")
-- Looking for pthread.h
-- Looking for pthread.h - found
-- Looking for pthread_create
-- Looking for pthread_create - not found
-- Looking for pthread_create in pthreads
-- Looking for pthread_create in pthreads - not found
-- Looking for pthread_create in pthread
-- Looking for pthread_create in pthread - found
-- Found Threads: TRUE
CMake Error at /usr/share/cmake/Modules/FindPackageHandleStandardArgs.cmake:137 (message):
Could NOT find Exiv2: Found unsuitable version "0.25.0", but required is at
least "0.26" (found /usr/lib64/libexiv2.so)
Call Stack (most recent call first):
/usr/share/cmake/Modules/FindPackageHandleStandardArgs.cmake:375 (_FPHSA_FAILURE_MESSAGE)
cmake/modules/FindExiv2.cmake:73 (find_package_handle_standard_args)
CMakeLists.txt:212 (find_package)
-- Configuring incomplete, errors occurred!
See also "/home/jenkins/workspace/Extragear digikam kf5-qt5 SUSEQt5.9/build/CMakeFiles/CMakeOutput.log".
See also "/home/jenkins/workspace/Extragear digikam kf5-qt5 SUSEQt5.9/build/CMakeFiles/CMakeError.log".
[Pipeline] }
[Pipeline] // stage
[Pipeline] }
ERROR: script returned exit code 1
[Pipeline] // catchError
[Pipeline] sh
[Extragear digikam kf5-qt5 SUSEQt5.9] Running shell script
+ python3 -u ci-tooling/helpers/capture-workspace.py --environment production
[Pipeline] emailextrecipients
[Pipeline] emailext


build.log (19K) Download Attachment
Reply | Threaded
Open this post in threaded view
|

KDE CI: Extragear digikam kf5-qt5 SUSEQt5.9 - Build # 35 - Still Failing!

no-reply
BUILD FAILURE
Build URL https://build.kde.org/job/Extragear%20digikam%20kf5-qt5%20SUSEQt5.9/35/
Project: Extragear digikam kf5-qt5 SUSEQt5.9
Date of build: Thu, 29 Jun 2017 14:42:48 +0000
Build duration: 1 min 18 sec and counting

CONSOLE OUTPUT
[...truncated 91.63 KB...]
'/usr/lib64/cmake/Qt5@module@/Qt5@[hidden email]'
Using the old result for compatibility since the policy is not set.
Call Stack (most recent call first):
/usr/lib64/cmake/Qt5/Qt5Config.cmake:25 (include)
CMakeLists.txt:130 (find_package)
This warning is for project developers. Use -Wno-dev to suppress it.
CMake Warning (dev) at /usr/lib64/cmake/Qt5/Qt5ModuleLocation.cmake:4 (set):
Policy CMP0053 is not set: Simplify variable reference and escape sequence
evaluation. Run "cmake --help-policy CMP0053" for policy details. Use the
cmake_policy command to set the policy and suppress this warning.
For input:
'${_qt5_install_prefix}/Qt5@module@/Qt5@[hidden email]'
the old evaluation rules produce:
'/usr/lib64/cmake/Qt5/Qt5Config.cmake'
but the new evaluation rules produce:
'/usr/lib64/cmake/Qt5@module@/Qt5@[hidden email]'
Using the old result for compatibility since the policy is not set.
Call Stack (most recent call first):
/usr/lib64/cmake/Qt5/Qt5Config.cmake:25 (include)
CMakeLists.txt:143 (find_package)
This warning is for project developers. Use -Wno-dev to suppress it.
-- Found KF5XmlGui: /home/jenkins/install-prefix/lib64/cmake/KF5XmlGui/KF5XmlGuiConfig.cmake (found version "5.36.0")
-- Found KF5CoreAddons: /home/jenkins/install-prefix/lib64/cmake/KF5CoreAddons/KF5CoreAddonsConfig.cmake (found version "5.36.0")
-- Found KF5Config: /home/jenkins/install-prefix/lib64/cmake/KF5Config/KF5ConfigConfig.cmake (found version "5.36.0")
-- Found KF5Service: /home/jenkins/install-prefix/lib64/cmake/KF5Service/KF5ServiceConfig.cmake (found version "5.36.0")
-- Found KF5WindowSystem: /home/jenkins/install-prefix/lib64/cmake/KF5WindowSystem/KF5WindowSystemConfig.cmake (found version "5.36.0")
-- Found KF5Solid: /home/jenkins/install-prefix/lib64/cmake/KF5Solid/KF5SolidConfig.cmake (found version "5.36.0")
-- Found Gettext: /usr/bin/msgmerge (found version "0.19.8.1")
-- Found PythonInterp: /usr/bin/python (found version "2.7.13")
-- Found KF5I18n: /home/jenkins/install-prefix/lib64/cmake/KF5I18n/KF5I18nConfig.cmake (found version "5.36.0")
-- Found KF5: success (found suitable version "5.36.0", minimum required is "5.1.0") found components: XmlGui CoreAddons Config Service WindowSystem Solid I18n
-- Found KF5KIO: /home/jenkins/install-prefix/lib64/cmake/KF5KIO/KF5KIOConfig.cmake (found version "5.36.0")
-- Found KF5IconThemes: /home/jenkins/install-prefix/lib64/cmake/KF5IconThemes/KF5IconThemesConfig.cmake (found version "5.36.0")
-- Found KF5FileMetaData: /home/jenkins/install-prefix/lib64/cmake/KF5FileMetaData/KF5FileMetaDataConfig.cmake (found version "5.36.0")
-- Found KF5ThreadWeaver: /home/jenkins/install-prefix/lib64/cmake/KF5ThreadWeaver/KF5ThreadWeaverConfig.cmake (found version "5.36.0")
-- Found KF5NotifyConfig: /home/jenkins/install-prefix/lib64/cmake/KF5NotifyConfig/KF5NotifyConfigConfig.cmake (found version "5.36.0")
-- Found KF5Notifications: /home/jenkins/install-prefix/lib64/cmake/KF5Notifications/KF5NotificationsConfig.cmake (found version "5.36.0")
-- Found KF5: success (found suitable version "5.36.0", minimum required is "5.1.0") found components: KIO IconThemes FileMetaData ThreadWeaver NotifyConfig Notifications
-- Boost version: 1.64.0
-- Found KF5AkonadiContact: /home/jenkins/install-prefix/lib64/cmake/KF5AkonadiContact/KF5AkonadiContactConfig.cmake (found version "5.5.60")
-- Found KF5: success (found suitable version "5.5.60", minimum required is "4.89.0") found components: AkonadiContact
-- Found Libical version 2.0
-- Found LibIcal: /usr/lib64/libical.so;/usr/lib64/libicalss.so (found suitable version "2.0", minimum required is "0.42")
-- Found KF5CalendarCore: /home/jenkins/install-prefix/lib64/cmake/KF5CalendarCore/KF5CalendarCoreConfig.cmake (found version "5.5.60")
-- Found KF5: success (found suitable version "5.5.60", minimum required is "4.81.0") found components: CalendarCore
-- KF5::KIOWidgets include dirs: /home/jenkins/install-prefix/include/KF5/KIOWidgets;/home/jenkins/install-prefix/include/KF5
-- Found JPEG: /usr/lib64/libjpeg.so
-- Libjpeg version: 62
-- Found TIFF: /usr/lib64/libtiff.so (found version "4.0.7")
-- Found ZLIB: /usr/lib64/libz.so (found version "1.2.11")
-- Found PNG: /usr/lib64/libpng.so (found version "1.6.29")
-- Boost version: 1.64.0
-- Found PkgConfig: /usr/bin/pkg-config (found version "0.29.2")
-- Checking for module 'lcms2'
-- Found lcms2, version 2.8
-- Found lcms version 2.08, /usr/lib64/liblcms2.so
-- Found EXPAT: /usr/lib64/libexpat.so (found version "2.2.0")
-- Looking for pthread.h
-- Looking for pthread.h - found
-- Looking for pthread_create
-- Looking for pthread_create - not found
-- Looking for pthread_create in pthreads
-- Looking for pthread_create in pthreads - not found
-- Looking for pthread_create in pthread
-- Looking for pthread_create in pthread - found
-- Found Threads: TRUE
CMake Error at /usr/share/cmake/Modules/FindPackageHandleStandardArgs.cmake:137 (message):
Could NOT find Exiv2: Found unsuitable version "0.25.0", but required is at
least "0.26" (found /usr/lib64/libexiv2.so)
Call Stack (most recent call first):
/usr/share/cmake/Modules/FindPackageHandleStandardArgs.cmake:375 (_FPHSA_FAILURE_MESSAGE)
cmake/modules/FindExiv2.cmake:73 (find_package_handle_standard_args)
CMakeLists.txt:212 (find_package)
-- Configuring incomplete, errors occurred!
See also "/home/jenkins/workspace/Extragear digikam kf5-qt5 SUSEQt5.9/build/CMakeFiles/CMakeOutput.log".
See also "/home/jenkins/workspace/Extragear digikam kf5-qt5 SUSEQt5.9/build/CMakeFiles/CMakeError.log".
[Pipeline] }
[Pipeline] // stage
[Pipeline] }
ERROR: script returned exit code 1
[Pipeline] // catchError
[Pipeline] sh
[Extragear digikam kf5-qt5 SUSEQt5.9] Running shell script
+ python3 -u ci-tooling/helpers/capture-workspace.py --environment production
[Pipeline] emailextrecipients
[Pipeline] emailext


build.log (19K) Download Attachment
Reply | Threaded
Open this post in threaded view
|

KDE CI: Extragear digikam kf5-qt5 SUSEQt5.9 - Build # 36 - Still Failing!

no-reply
BUILD FAILURE
Build URL https://build.kde.org/job/Extragear%20digikam%20kf5-qt5%20SUSEQt5.9/36/
Project: Extragear digikam kf5-qt5 SUSEQt5.9
Date of build: Thu, 29 Jun 2017 14:59:53 +0000
Build duration: 1 min 21 sec and counting

CONSOLE OUTPUT
[...truncated 91.64 KB...]
'/usr/lib64/cmake/Qt5@module@/Qt5@[hidden email]'
Using the old result for compatibility since the policy is not set.
Call Stack (most recent call first):
/usr/lib64/cmake/Qt5/Qt5Config.cmake:25 (include)
CMakeLists.txt:130 (find_package)
This warning is for project developers. Use -Wno-dev to suppress it.
CMake Warning (dev) at /usr/lib64/cmake/Qt5/Qt5ModuleLocation.cmake:4 (set):
Policy CMP0053 is not set: Simplify variable reference and escape sequence
evaluation. Run "cmake --help-policy CMP0053" for policy details. Use the
cmake_policy command to set the policy and suppress this warning.
For input:
'${_qt5_install_prefix}/Qt5@module@/Qt5@[hidden email]'
the old evaluation rules produce:
'/usr/lib64/cmake/Qt5/Qt5Config.cmake'
but the new evaluation rules produce:
'/usr/lib64/cmake/Qt5@module@/Qt5@[hidden email]'
Using the old result for compatibility since the policy is not set.
Call Stack (most recent call first):
/usr/lib64/cmake/Qt5/Qt5Config.cmake:25 (include)
CMakeLists.txt:143 (find_package)
This warning is for project developers. Use -Wno-dev to suppress it.
-- Found KF5XmlGui: /home/jenkins/install-prefix/lib64/cmake/KF5XmlGui/KF5XmlGuiConfig.cmake (found version "5.36.0")
-- Found KF5CoreAddons: /home/jenkins/install-prefix/lib64/cmake/KF5CoreAddons/KF5CoreAddonsConfig.cmake (found version "5.36.0")
-- Found KF5Config: /home/jenkins/install-prefix/lib64/cmake/KF5Config/KF5ConfigConfig.cmake (found version "5.36.0")
-- Found KF5Service: /home/jenkins/install-prefix/lib64/cmake/KF5Service/KF5ServiceConfig.cmake (found version "5.36.0")
-- Found KF5WindowSystem: /home/jenkins/install-prefix/lib64/cmake/KF5WindowSystem/KF5WindowSystemConfig.cmake (found version "5.36.0")
-- Found KF5Solid: /home/jenkins/install-prefix/lib64/cmake/KF5Solid/KF5SolidConfig.cmake (found version "5.36.0")
-- Found Gettext: /usr/bin/msgmerge (found version "0.19.8.1")
-- Found PythonInterp: /usr/bin/python (found version "2.7.13")
-- Found KF5I18n: /home/jenkins/install-prefix/lib64/cmake/KF5I18n/KF5I18nConfig.cmake (found version "5.36.0")
-- Found KF5: success (found suitable version "5.36.0", minimum required is "5.1.0") found components: XmlGui CoreAddons Config Service WindowSystem Solid I18n
-- Found KF5KIO: /home/jenkins/install-prefix/lib64/cmake/KF5KIO/KF5KIOConfig.cmake (found version "5.36.0")
-- Found KF5IconThemes: /home/jenkins/install-prefix/lib64/cmake/KF5IconThemes/KF5IconThemesConfig.cmake (found version "5.36.0")
-- Found KF5FileMetaData: /home/jenkins/install-prefix/lib64/cmake/KF5FileMetaData/KF5FileMetaDataConfig.cmake (found version "5.36.0")
-- Found KF5ThreadWeaver: /home/jenkins/install-prefix/lib64/cmake/KF5ThreadWeaver/KF5ThreadWeaverConfig.cmake (found version "5.36.0")
-- Found KF5NotifyConfig: /home/jenkins/install-prefix/lib64/cmake/KF5NotifyConfig/KF5NotifyConfigConfig.cmake (found version "5.36.0")
-- Found KF5Notifications: /home/jenkins/install-prefix/lib64/cmake/KF5Notifications/KF5NotificationsConfig.cmake (found version "5.36.0")
-- Found KF5: success (found suitable version "5.36.0", minimum required is "5.1.0") found components: KIO IconThemes FileMetaData ThreadWeaver NotifyConfig Notifications
-- Boost version: 1.64.0
-- Found KF5AkonadiContact: /home/jenkins/install-prefix/lib64/cmake/KF5AkonadiContact/KF5AkonadiContactConfig.cmake (found version "5.5.60")
-- Found KF5: success (found suitable version "5.5.60", minimum required is "4.89.0") found components: AkonadiContact
-- Found Libical version 2.0
-- Found LibIcal: /usr/lib64/libical.so;/usr/lib64/libicalss.so (found suitable version "2.0", minimum required is "0.42")
-- Found KF5CalendarCore: /home/jenkins/install-prefix/lib64/cmake/KF5CalendarCore/KF5CalendarCoreConfig.cmake (found version "5.5.60")
-- Found KF5: success (found suitable version "5.5.60", minimum required is "4.81.0") found components: CalendarCore
-- KF5::KIOWidgets include dirs: /home/jenkins/install-prefix/include/KF5/KIOWidgets;/home/jenkins/install-prefix/include/KF5
-- Found JPEG: /usr/lib64/libjpeg.so
-- Libjpeg version: 62
-- Found TIFF: /usr/lib64/libtiff.so (found version "4.0.7")
-- Found ZLIB: /usr/lib64/libz.so (found version "1.2.11")
-- Found PNG: /usr/lib64/libpng.so (found version "1.6.29")
-- Boost version: 1.64.0
-- Found PkgConfig: /usr/bin/pkg-config (found version "0.29.2")
-- Checking for module 'lcms2'
-- Found lcms2, version 2.8
-- Found lcms version 2.08, /usr/lib64/liblcms2.so
-- Found EXPAT: /usr/lib64/libexpat.so (found version "2.2.0")
-- Looking for pthread.h
-- Looking for pthread.h - found
-- Looking for pthread_create
-- Looking for pthread_create - not found
-- Looking for pthread_create in pthreads
-- Looking for pthread_create in pthreads - not found
-- Looking for pthread_create in pthread
-- Looking for pthread_create in pthread - found
-- Found Threads: TRUE
CMake Error at /usr/share/cmake/Modules/FindPackageHandleStandardArgs.cmake:137 (message):
Could NOT find Exiv2: Found unsuitable version "0.25.0", but required is at
least "0.26" (found /usr/lib64/libexiv2.so)
Call Stack (most recent call first):
/usr/share/cmake/Modules/FindPackageHandleStandardArgs.cmake:375 (_FPHSA_FAILURE_MESSAGE)
cmake/modules/FindExiv2.cmake:73 (find_package_handle_standard_args)
CMakeLists.txt:212 (find_package)
-- Configuring incomplete, errors occurred!
See also "/home/jenkins/workspace/Extragear digikam kf5-qt5 SUSEQt5.9/build/CMakeFiles/CMakeOutput.log".
See also "/home/jenkins/workspace/Extragear digikam kf5-qt5 SUSEQt5.9/build/CMakeFiles/CMakeError.log".
[Pipeline] }
[Pipeline] // stage
[Pipeline] }
ERROR: script returned exit code 1
[Pipeline] // catchError
[Pipeline] sh
[Extragear digikam kf5-qt5 SUSEQt5.9] Running shell script
+ python3 -u ci-tooling/helpers/capture-workspace.py --environment production
[Pipeline] emailextrecipients
[Pipeline] emailext


build.log (26K) Download Attachment
Reply | Threaded
Open this post in threaded view
|

KDE CI: Extragear digikam kf5-qt5 SUSEQt5.9 - Build # 37 - Still Failing!

no-reply
BUILD FAILURE
Build URL https://build.kde.org/job/Extragear%20digikam%20kf5-qt5%20SUSEQt5.9/37/
Project: Extragear digikam kf5-qt5 SUSEQt5.9
Date of build: Thu, 29 Jun 2017 15:07:58 +0000
Build duration: 1 min 20 sec and counting

CONSOLE OUTPUT
[...truncated 91.68 KB...]
'/usr/lib64/cmake/Qt5@module@/Qt5@[hidden email]'
Using the old result for compatibility since the policy is not set.
Call Stack (most recent call first):
/usr/lib64/cmake/Qt5/Qt5Config.cmake:25 (include)
CMakeLists.txt:130 (find_package)
This warning is for project developers. Use -Wno-dev to suppress it.
CMake Warning (dev) at /usr/lib64/cmake/Qt5/Qt5ModuleLocation.cmake:4 (set):
Policy CMP0053 is not set: Simplify variable reference and escape sequence
evaluation. Run "cmake --help-policy CMP0053" for policy details. Use the
cmake_policy command to set the policy and suppress this warning.
For input:
'${_qt5_install_prefix}/Qt5@module@/Qt5@[hidden email]'
the old evaluation rules produce:
'/usr/lib64/cmake/Qt5/Qt5Config.cmake'
but the new evaluation rules produce:
'/usr/lib64/cmake/Qt5@module@/Qt5@[hidden email]'
Using the old result for compatibility since the policy is not set.
Call Stack (most recent call first):
/usr/lib64/cmake/Qt5/Qt5Config.cmake:25 (include)
CMakeLists.txt:143 (find_package)
This warning is for project developers. Use -Wno-dev to suppress it.
-- Found KF5XmlGui: /home/jenkins/install-prefix/lib64/cmake/KF5XmlGui/KF5XmlGuiConfig.cmake (found version "5.36.0")
-- Found KF5CoreAddons: /home/jenkins/install-prefix/lib64/cmake/KF5CoreAddons/KF5CoreAddonsConfig.cmake (found version "5.36.0")
-- Found KF5Config: /home/jenkins/install-prefix/lib64/cmake/KF5Config/KF5ConfigConfig.cmake (found version "5.36.0")
-- Found KF5Service: /home/jenkins/install-prefix/lib64/cmake/KF5Service/KF5ServiceConfig.cmake (found version "5.36.0")
-- Found KF5WindowSystem: /home/jenkins/install-prefix/lib64/cmake/KF5WindowSystem/KF5WindowSystemConfig.cmake (found version "5.36.0")
-- Found KF5Solid: /home/jenkins/install-prefix/lib64/cmake/KF5Solid/KF5SolidConfig.cmake (found version "5.36.0")
-- Found Gettext: /usr/bin/msgmerge (found version "0.19.8.1")
-- Found PythonInterp: /usr/bin/python (found version "2.7.13")
-- Found KF5I18n: /home/jenkins/install-prefix/lib64/cmake/KF5I18n/KF5I18nConfig.cmake (found version "5.36.0")
-- Found KF5: success (found suitable version "5.36.0", minimum required is "5.1.0") found components: XmlGui CoreAddons Config Service WindowSystem Solid I18n
-- Found KF5KIO: /home/jenkins/install-prefix/lib64/cmake/KF5KIO/KF5KIOConfig.cmake (found version "5.36.0")
-- Found KF5IconThemes: /home/jenkins/install-prefix/lib64/cmake/KF5IconThemes/KF5IconThemesConfig.cmake (found version "5.36.0")
-- Found KF5FileMetaData: /home/jenkins/install-prefix/lib64/cmake/KF5FileMetaData/KF5FileMetaDataConfig.cmake (found version "5.36.0")
-- Found KF5ThreadWeaver: /home/jenkins/install-prefix/lib64/cmake/KF5ThreadWeaver/KF5ThreadWeaverConfig.cmake (found version "5.36.0")
-- Found KF5NotifyConfig: /home/jenkins/install-prefix/lib64/cmake/KF5NotifyConfig/KF5NotifyConfigConfig.cmake (found version "5.36.0")
-- Found KF5Notifications: /home/jenkins/install-prefix/lib64/cmake/KF5Notifications/KF5NotificationsConfig.cmake (found version "5.36.0")
-- Found KF5: success (found suitable version "5.36.0", minimum required is "5.1.0") found components: KIO IconThemes FileMetaData ThreadWeaver NotifyConfig Notifications
-- Boost version: 1.64.0
-- Found KF5AkonadiContact: /home/jenkins/install-prefix/lib64/cmake/KF5AkonadiContact/KF5AkonadiContactConfig.cmake (found version "5.5.60")
-- Found KF5: success (found suitable version "5.5.60", minimum required is "4.89.0") found components: AkonadiContact
-- Found Libical version 2.0
-- Found LibIcal: /usr/lib64/libical.so;/usr/lib64/libicalss.so (found suitable version "2.0", minimum required is "0.42")
-- Found KF5CalendarCore: /home/jenkins/install-prefix/lib64/cmake/KF5CalendarCore/KF5CalendarCoreConfig.cmake (found version "5.5.60")
-- Found KF5: success (found suitable version "5.5.60", minimum required is "4.81.0") found components: CalendarCore
-- KF5::KIOWidgets include dirs: /home/jenkins/install-prefix/include/KF5/KIOWidgets;/home/jenkins/install-prefix/include/KF5
-- Found JPEG: /usr/lib64/libjpeg.so
-- Libjpeg version: 62
-- Found TIFF: /usr/lib64/libtiff.so (found version "4.0.7")
-- Found ZLIB: /usr/lib64/libz.so (found version "1.2.11")
-- Found PNG: /usr/lib64/libpng.so (found version "1.6.29")
-- Boost version: 1.64.0
-- Found PkgConfig: /usr/bin/pkg-config (found version "0.29.2")
-- Checking for module 'lcms2'
-- Found lcms2, version 2.8
-- Found lcms version 2.08, /usr/lib64/liblcms2.so
-- Found EXPAT: /usr/lib64/libexpat.so (found version "2.2.0")
-- Looking for pthread.h
-- Looking for pthread.h - found
-- Looking for pthread_create
-- Looking for pthread_create - not found
-- Looking for pthread_create in pthreads
-- Looking for pthread_create in pthreads - not found
-- Looking for pthread_create in pthread
-- Looking for pthread_create in pthread - found
-- Found Threads: TRUE
CMake Error at /usr/share/cmake/Modules/FindPackageHandleStandardArgs.cmake:137 (message):
Could NOT find Exiv2: Found unsuitable version "0.25.0", but required is at
least "0.26" (found /usr/lib64/libexiv2.so)
Call Stack (most recent call first):
/usr/share/cmake/Modules/FindPackageHandleStandardArgs.cmake:375 (_FPHSA_FAILURE_MESSAGE)
cmake/modules/FindExiv2.cmake:73 (find_package_handle_standard_args)
CMakeLists.txt:212 (find_package)
-- Configuring incomplete, errors occurred!
See also "/home/jenkins/workspace/Extragear digikam kf5-qt5 SUSEQt5.9/build/CMakeFiles/CMakeOutput.log".
See also "/home/jenkins/workspace/Extragear digikam kf5-qt5 SUSEQt5.9/build/CMakeFiles/CMakeError.log".
[Pipeline] }
[Pipeline] // stage
[Pipeline] }
ERROR: script returned exit code 1
[Pipeline] // catchError
[Pipeline] sh
[Extragear digikam kf5-qt5 SUSEQt5.9] Running shell script
+ python3 -u ci-tooling/helpers/capture-workspace.py --environment production
[Pipeline] emailextrecipients
[Pipeline] emailext


build.log (19K) Download Attachment
Reply | Threaded
Open this post in threaded view
|

KDE CI: Extragear digikam kf5-qt5 SUSEQt5.9 - Build # 38 - Still Failing!

no-reply
BUILD FAILURE
Build URL https://build.kde.org/job/Extragear%20digikam%20kf5-qt5%20SUSEQt5.9/38/
Project: Extragear digikam kf5-qt5 SUSEQt5.9
Date of build: Thu, 29 Jun 2017 15:09:20 +0000
Build duration: 1 min 18 sec and counting

CONSOLE OUTPUT
[...truncated 91.42 KB...]
'/usr/lib64/cmake/Qt5@module@/Qt5@[hidden email]'
Using the old result for compatibility since the policy is not set.
Call Stack (most recent call first):
/usr/lib64/cmake/Qt5/Qt5Config.cmake:25 (include)
CMakeLists.txt:130 (find_package)
This warning is for project developers. Use -Wno-dev to suppress it.
CMake Warning (dev) at /usr/lib64/cmake/Qt5/Qt5ModuleLocation.cmake:4 (set):
Policy CMP0053 is not set: Simplify variable reference and escape sequence
evaluation. Run "cmake --help-policy CMP0053" for policy details. Use the
cmake_policy command to set the policy and suppress this warning.
For input:
'${_qt5_install_prefix}/Qt5@module@/Qt5@[hidden email]'
the old evaluation rules produce:
'/usr/lib64/cmake/Qt5/Qt5Config.cmake'
but the new evaluation rules produce:
'/usr/lib64/cmake/Qt5@module@/Qt5@[hidden email]'
Using the old result for compatibility since the policy is not set.
Call Stack (most recent call first):
/usr/lib64/cmake/Qt5/Qt5Config.cmake:25 (include)
CMakeLists.txt:143 (find_package)
This warning is for project developers. Use -Wno-dev to suppress it.
-- Found KF5XmlGui: /home/jenkins/install-prefix/lib64/cmake/KF5XmlGui/KF5XmlGuiConfig.cmake (found version "5.36.0")
-- Found KF5CoreAddons: /home/jenkins/install-prefix/lib64/cmake/KF5CoreAddons/KF5CoreAddonsConfig.cmake (found version "5.36.0")
-- Found KF5Config: /home/jenkins/install-prefix/lib64/cmake/KF5Config/KF5ConfigConfig.cmake (found version "5.36.0")
-- Found KF5Service: /home/jenkins/install-prefix/lib64/cmake/KF5Service/KF5ServiceConfig.cmake (found version "5.36.0")
-- Found KF5WindowSystem: /home/jenkins/install-prefix/lib64/cmake/KF5WindowSystem/KF5WindowSystemConfig.cmake (found version "5.36.0")
-- Found KF5Solid: /home/jenkins/install-prefix/lib64/cmake/KF5Solid/KF5SolidConfig.cmake (found version "5.36.0")
-- Found Gettext: /usr/bin/msgmerge (found version "0.19.8.1")
-- Found PythonInterp: /usr/bin/python (found version "2.7.13")
-- Found KF5I18n: /home/jenkins/install-prefix/lib64/cmake/KF5I18n/KF5I18nConfig.cmake (found version "5.36.0")
-- Found KF5: success (found suitable version "5.36.0", minimum required is "5.1.0") found components: XmlGui CoreAddons Config Service WindowSystem Solid I18n
-- Found KF5KIO: /home/jenkins/install-prefix/lib64/cmake/KF5KIO/KF5KIOConfig.cmake (found version "5.36.0")
-- Found KF5IconThemes: /home/jenkins/install-prefix/lib64/cmake/KF5IconThemes/KF5IconThemesConfig.cmake (found version "5.36.0")
-- Found KF5FileMetaData: /home/jenkins/install-prefix/lib64/cmake/KF5FileMetaData/KF5FileMetaDataConfig.cmake (found version "5.36.0")
-- Found KF5ThreadWeaver: /home/jenkins/install-prefix/lib64/cmake/KF5ThreadWeaver/KF5ThreadWeaverConfig.cmake (found version "5.36.0")
-- Found KF5NotifyConfig: /home/jenkins/install-prefix/lib64/cmake/KF5NotifyConfig/KF5NotifyConfigConfig.cmake (found version "5.36.0")
-- Found KF5Notifications: /home/jenkins/install-prefix/lib64/cmake/KF5Notifications/KF5NotificationsConfig.cmake (found version "5.36.0")
-- Found KF5: success (found suitable version "5.36.0", minimum required is "5.1.0") found components: KIO IconThemes FileMetaData ThreadWeaver NotifyConfig Notifications
-- Boost version: 1.64.0
-- Found KF5AkonadiContact: /home/jenkins/install-prefix/lib64/cmake/KF5AkonadiContact/KF5AkonadiContactConfig.cmake (found version "5.5.60")
-- Found KF5: success (found suitable version "5.5.60", minimum required is "4.89.0") found components: AkonadiContact
-- Found Libical version 2.0
-- Found LibIcal: /usr/lib64/libical.so;/usr/lib64/libicalss.so (found suitable version "2.0", minimum required is "0.42")
-- Found KF5CalendarCore: /home/jenkins/install-prefix/lib64/cmake/KF5CalendarCore/KF5CalendarCoreConfig.cmake (found version "5.5.60")
-- Found KF5: success (found suitable version "5.5.60", minimum required is "4.81.0") found components: CalendarCore
-- KF5::KIOWidgets include dirs: /home/jenkins/install-prefix/include/KF5/KIOWidgets;/home/jenkins/install-prefix/include/KF5
-- Found JPEG: /usr/lib64/libjpeg.so
-- Libjpeg version: 62
-- Found TIFF: /usr/lib64/libtiff.so (found version "4.0.7")
-- Found ZLIB: /usr/lib64/libz.so (found version "1.2.11")
-- Found PNG: /usr/lib64/libpng.so (found version "1.6.29")
-- Boost version: 1.64.0
-- Found PkgConfig: /usr/bin/pkg-config (found version "0.29.2")
-- Checking for module 'lcms2'
-- Found lcms2, version 2.8
-- Found lcms version 2.08, /usr/lib64/liblcms2.so
-- Found EXPAT: /usr/lib64/libexpat.so (found version "2.2.0")
-- Looking for pthread.h
-- Looking for pthread.h - found
-- Looking for pthread_create
-- Looking for pthread_create - not found
-- Looking for pthread_create in pthreads
-- Looking for pthread_create in pthreads - not found
-- Looking for pthread_create in pthread
-- Looking for pthread_create in pthread - found
-- Found Threads: TRUE
CMake Error at /usr/share/cmake/Modules/FindPackageHandleStandardArgs.cmake:137 (message):
Could NOT find Exiv2: Found unsuitable version "0.25.0", but required is at
least "0.26" (found /usr/lib64/libexiv2.so)
Call Stack (most recent call first):
/usr/share/cmake/Modules/FindPackageHandleStandardArgs.cmake:375 (_FPHSA_FAILURE_MESSAGE)
cmake/modules/FindExiv2.cmake:73 (find_package_handle_standard_args)
CMakeLists.txt:212 (find_package)
-- Configuring incomplete, errors occurred!
See also "/home/jenkins/workspace/Extragear digikam kf5-qt5 SUSEQt5.9/build/CMakeFiles/CMakeOutput.log".
See also "/home/jenkins/workspace/Extragear digikam kf5-qt5 SUSEQt5.9/build/CMakeFiles/CMakeError.log".
[Pipeline] }
[Pipeline] // stage
[Pipeline] }
ERROR: script returned exit code 1
[Pipeline] // catchError
[Pipeline] sh
[Extragear digikam kf5-qt5 SUSEQt5.9] Running shell script
+ python3 -u ci-tooling/helpers/capture-workspace.py --environment production
[Pipeline] emailextrecipients
[Pipeline] emailext


build.log (19K) Download Attachment
Reply | Threaded
Open this post in threaded view
|

KDE CI: Extragear digikam kf5-qt5 SUSEQt5.9 - Build # 39 - Still Failing!

no-reply
BUILD FAILURE
Build URL https://build.kde.org/job/Extragear%20digikam%20kf5-qt5%20SUSEQt5.9/39/
Project: Extragear digikam kf5-qt5 SUSEQt5.9
Date of build: Thu, 29 Jun 2017 15:20:39 +0000
Build duration: 9 min 6 sec and counting

CONSOLE OUTPUT
[...truncated 92.00 KB...]
'/usr/lib64/cmake/Qt5@module@/Qt5@[hidden email]'
Using the old result for compatibility since the policy is not set.
Call Stack (most recent call first):
/usr/lib64/cmake/Qt5/Qt5Config.cmake:25 (include)
CMakeLists.txt:130 (find_package)
This warning is for project developers. Use -Wno-dev to suppress it.
CMake Warning (dev) at /usr/lib64/cmake/Qt5/Qt5ModuleLocation.cmake:4 (set):
Policy CMP0053 is not set: Simplify variable reference and escape sequence
evaluation. Run "cmake --help-policy CMP0053" for policy details. Use the
cmake_policy command to set the policy and suppress this warning.
For input:
'${_qt5_install_prefix}/Qt5@module@/Qt5@[hidden email]'
the old evaluation rules produce:
'/usr/lib64/cmake/Qt5/Qt5Config.cmake'
but the new evaluation rules produce:
'/usr/lib64/cmake/Qt5@module@/Qt5@[hidden email]'
Using the old result for compatibility since the policy is not set.
Call Stack (most recent call first):
/usr/lib64/cmake/Qt5/Qt5Config.cmake:25 (include)
CMakeLists.txt:143 (find_package)
This warning is for project developers. Use -Wno-dev to suppress it.
-- Found KF5XmlGui: /home/jenkins/install-prefix/lib64/cmake/KF5XmlGui/KF5XmlGuiConfig.cmake (found version "5.36.0")
-- Found KF5CoreAddons: /home/jenkins/install-prefix/lib64/cmake/KF5CoreAddons/KF5CoreAddonsConfig.cmake (found version "5.36.0")
-- Found KF5Config: /home/jenkins/install-prefix/lib64/cmake/KF5Config/KF5ConfigConfig.cmake (found version "5.36.0")
-- Found KF5Service: /home/jenkins/install-prefix/lib64/cmake/KF5Service/KF5ServiceConfig.cmake (found version "5.36.0")
-- Found KF5WindowSystem: /home/jenkins/install-prefix/lib64/cmake/KF5WindowSystem/KF5WindowSystemConfig.cmake (found version "5.36.0")
-- Found KF5Solid: /home/jenkins/install-prefix/lib64/cmake/KF5Solid/KF5SolidConfig.cmake (found version "5.36.0")
-- Found Gettext: /usr/bin/msgmerge (found version "0.19.8.1")
-- Found PythonInterp: /usr/bin/python (found version "2.7.13")
-- Found KF5I18n: /home/jenkins/install-prefix/lib64/cmake/KF5I18n/KF5I18nConfig.cmake (found version "5.36.0")
-- Found KF5: success (found suitable version "5.36.0", minimum required is "5.1.0") found components: XmlGui CoreAddons Config Service WindowSystem Solid I18n
-- Found KF5KIO: /home/jenkins/install-prefix/lib64/cmake/KF5KIO/KF5KIOConfig.cmake (found version "5.36.0")
-- Found KF5IconThemes: /home/jenkins/install-prefix/lib64/cmake/KF5IconThemes/KF5IconThemesConfig.cmake (found version "5.36.0")
-- Found KF5FileMetaData: /home/jenkins/install-prefix/lib64/cmake/KF5FileMetaData/KF5FileMetaDataConfig.cmake (found version "5.36.0")
-- Found KF5ThreadWeaver: /home/jenkins/install-prefix/lib64/cmake/KF5ThreadWeaver/KF5ThreadWeaverConfig.cmake (found version "5.36.0")
-- Found KF5NotifyConfig: /home/jenkins/install-prefix/lib64/cmake/KF5NotifyConfig/KF5NotifyConfigConfig.cmake (found version "5.36.0")
-- Found KF5Notifications: /home/jenkins/install-prefix/lib64/cmake/KF5Notifications/KF5NotificationsConfig.cmake (found version "5.36.0")
-- Found KF5: success (found suitable version "5.36.0", minimum required is "5.1.0") found components: KIO IconThemes FileMetaData ThreadWeaver NotifyConfig Notifications
-- Boost version: 1.64.0
-- Found KF5AkonadiContact: /home/jenkins/install-prefix/lib64/cmake/KF5AkonadiContact/KF5AkonadiContactConfig.cmake (found version "5.5.60")
-- Found KF5: success (found suitable version "5.5.60", minimum required is "4.89.0") found components: AkonadiContact
-- Found Libical version 2.0
-- Found LibIcal: /usr/lib64/libical.so;/usr/lib64/libicalss.so (found suitable version "2.0", minimum required is "0.42")
-- Found KF5CalendarCore: /home/jenkins/install-prefix/lib64/cmake/KF5CalendarCore/KF5CalendarCoreConfig.cmake (found version "5.5.60")
-- Found KF5: success (found suitable version "5.5.60", minimum required is "4.81.0") found components: CalendarCore
-- KF5::KIOWidgets include dirs: /home/jenkins/install-prefix/include/KF5/KIOWidgets;/home/jenkins/install-prefix/include/KF5
-- Found JPEG: /usr/lib64/libjpeg.so
-- Libjpeg version: 62
-- Found TIFF: /usr/lib64/libtiff.so (found version "4.0.7")
-- Found ZLIB: /usr/lib64/libz.so (found version "1.2.11")
-- Found PNG: /usr/lib64/libpng.so (found version "1.6.29")
-- Boost version: 1.64.0
-- Found PkgConfig: /usr/bin/pkg-config (found version "0.29.2")
-- Checking for module 'lcms2'
-- Found lcms2, version 2.8
-- Found lcms version 2.08, /usr/lib64/liblcms2.so
-- Found EXPAT: /usr/lib64/libexpat.so (found version "2.2.0")
-- Looking for pthread.h
-- Looking for pthread.h - found
-- Looking for pthread_create
-- Looking for pthread_create - not found
-- Looking for pthread_create in pthreads
-- Looking for pthread_create in pthreads - not found
-- Looking for pthread_create in pthread
-- Looking for pthread_create in pthread - found
-- Found Threads: TRUE
CMake Error at /usr/share/cmake/Modules/FindPackageHandleStandardArgs.cmake:137 (message):
Could NOT find Exiv2: Found unsuitable version "0.25.0", but required is at
least "0.26" (found /usr/lib64/libexiv2.so)
Call Stack (most recent call first):
/usr/share/cmake/Modules/FindPackageHandleStandardArgs.cmake:375 (_FPHSA_FAILURE_MESSAGE)
cmake/modules/FindExiv2.cmake:73 (find_package_handle_standard_args)
CMakeLists.txt:212 (find_package)
-- Configuring incomplete, errors occurred!
See also "/home/jenkins/workspace/Extragear digikam kf5-qt5 SUSEQt5.9/build/CMakeFiles/CMakeOutput.log".
See also "/home/jenkins/workspace/Extragear digikam kf5-qt5 SUSEQt5.9/build/CMakeFiles/CMakeError.log".
[Pipeline] }
[Pipeline] // stage
[Pipeline] }
ERROR: script returned exit code 1
[Pipeline] // catchError
[Pipeline] sh
[Extragear digikam kf5-qt5 SUSEQt5.9] Running shell script
+ python3 -u ci-tooling/helpers/capture-workspace.py --environment production
[Pipeline] emailextrecipients
[Pipeline] emailext


build.log (19K) Download Attachment
Reply | Threaded
Open this post in threaded view
|

KDE CI: Extragear digikam kf5-qt5 SUSEQt5.9 - Build # 40 - Still Failing!

no-reply
BUILD FAILURE
Build URL https://build.kde.org/job/Extragear%20digikam%20kf5-qt5%20SUSEQt5.9/40/
Project: Extragear digikam kf5-qt5 SUSEQt5.9
Date of build: Thu, 29 Jun 2017 15:29:49 +0000
Build duration: 1 min 47 sec and counting

CONSOLE OUTPUT
[...truncated 91.81 KB...]
'/usr/lib64/cmake/Qt5@module@/Qt5@[hidden email]'
Using the old result for compatibility since the policy is not set.
Call Stack (most recent call first):
/usr/lib64/cmake/Qt5/Qt5Config.cmake:25 (include)
CMakeLists.txt:130 (find_package)
This warning is for project developers. Use -Wno-dev to suppress it.
CMake Warning (dev) at /usr/lib64/cmake/Qt5/Qt5ModuleLocation.cmake:4 (set):
Policy CMP0053 is not set: Simplify variable reference and escape sequence
evaluation. Run "cmake --help-policy CMP0053" for policy details. Use the
cmake_policy command to set the policy and suppress this warning.
For input:
'${_qt5_install_prefix}/Qt5@module@/Qt5@[hidden email]'
the old evaluation rules produce:
'/usr/lib64/cmake/Qt5/Qt5Config.cmake'
but the new evaluation rules produce:
'/usr/lib64/cmake/Qt5@module@/Qt5@[hidden email]'
Using the old result for compatibility since the policy is not set.
Call Stack (most recent call first):
/usr/lib64/cmake/Qt5/Qt5Config.cmake:25 (include)
CMakeLists.txt:143 (find_package)
This warning is for project developers. Use -Wno-dev to suppress it.
-- Found KF5XmlGui: /home/jenkins/install-prefix/lib64/cmake/KF5XmlGui/KF5XmlGuiConfig.cmake (found version "5.36.0")
-- Found KF5CoreAddons: /home/jenkins/install-prefix/lib64/cmake/KF5CoreAddons/KF5CoreAddonsConfig.cmake (found version "5.36.0")
-- Found KF5Config: /home/jenkins/install-prefix/lib64/cmake/KF5Config/KF5ConfigConfig.cmake (found version "5.36.0")
-- Found KF5Service: /home/jenkins/install-prefix/lib64/cmake/KF5Service/KF5ServiceConfig.cmake (found version "5.36.0")
-- Found KF5WindowSystem: /home/jenkins/install-prefix/lib64/cmake/KF5WindowSystem/KF5WindowSystemConfig.cmake (found version "5.36.0")
-- Found KF5Solid: /home/jenkins/install-prefix/lib64/cmake/KF5Solid/KF5SolidConfig.cmake (found version "5.36.0")
-- Found Gettext: /usr/bin/msgmerge (found version "0.19.8.1")
-- Found PythonInterp: /usr/bin/python (found version "2.7.13")
-- Found KF5I18n: /home/jenkins/install-prefix/lib64/cmake/KF5I18n/KF5I18nConfig.cmake (found version "5.36.0")
-- Found KF5: success (found suitable version "5.36.0", minimum required is "5.1.0") found components: XmlGui CoreAddons Config Service WindowSystem Solid I18n
-- Found KF5KIO: /home/jenkins/install-prefix/lib64/cmake/KF5KIO/KF5KIOConfig.cmake (found version "5.36.0")
-- Found KF5IconThemes: /home/jenkins/install-prefix/lib64/cmake/KF5IconThemes/KF5IconThemesConfig.cmake (found version "5.36.0")
-- Found KF5FileMetaData: /home/jenkins/install-prefix/lib64/cmake/KF5FileMetaData/KF5FileMetaDataConfig.cmake (found version "5.36.0")
-- Found KF5ThreadWeaver: /home/jenkins/install-prefix/lib64/cmake/KF5ThreadWeaver/KF5ThreadWeaverConfig.cmake (found version "5.36.0")
-- Found KF5NotifyConfig: /home/jenkins/install-prefix/lib64/cmake/KF5NotifyConfig/KF5NotifyConfigConfig.cmake (found version "5.36.0")
-- Found KF5Notifications: /home/jenkins/install-prefix/lib64/cmake/KF5Notifications/KF5NotificationsConfig.cmake (found version "5.36.0")
-- Found KF5: success (found suitable version "5.36.0", minimum required is "5.1.0") found components: KIO IconThemes FileMetaData ThreadWeaver NotifyConfig Notifications
-- Boost version: 1.64.0
-- Found KF5AkonadiContact: /home/jenkins/install-prefix/lib64/cmake/KF5AkonadiContact/KF5AkonadiContactConfig.cmake (found version "5.5.60")
-- Found KF5: success (found suitable version "5.5.60", minimum required is "4.89.0") found components: AkonadiContact
-- Found Libical version 2.0
-- Found LibIcal: /usr/lib64/libical.so;/usr/lib64/libicalss.so (found suitable version "2.0", minimum required is "0.42")
-- Found KF5CalendarCore: /home/jenkins/install-prefix/lib64/cmake/KF5CalendarCore/KF5CalendarCoreConfig.cmake (found version "5.5.60")
-- Found KF5: success (found suitable version "5.5.60", minimum required is "4.81.0") found components: CalendarCore
-- KF5::KIOWidgets include dirs: /home/jenkins/install-prefix/include/KF5/KIOWidgets;/home/jenkins/install-prefix/include/KF5
-- Found JPEG: /usr/lib64/libjpeg.so
-- Libjpeg version: 62
-- Found TIFF: /usr/lib64/libtiff.so (found version "4.0.7")
-- Found ZLIB: /usr/lib64/libz.so (found version "1.2.11")
-- Found PNG: /usr/lib64/libpng.so (found version "1.6.29")
-- Boost version: 1.64.0
-- Found PkgConfig: /usr/bin/pkg-config (found version "0.29.2")
-- Checking for module 'lcms2'
-- Found lcms2, version 2.8
-- Found lcms version 2.08, /usr/lib64/liblcms2.so
-- Found EXPAT: /usr/lib64/libexpat.so (found version "2.2.0")
-- Looking for pthread.h
-- Looking for pthread.h - found
-- Looking for pthread_create
-- Looking for pthread_create - not found
-- Looking for pthread_create in pthreads
-- Looking for pthread_create in pthreads - not found
-- Looking for pthread_create in pthread
-- Looking for pthread_create in pthread - found
-- Found Threads: TRUE
CMake Error at /usr/share/cmake/Modules/FindPackageHandleStandardArgs.cmake:137 (message):
Could NOT find Exiv2: Found unsuitable version "0.25.0", but required is at
least "0.26" (found /usr/lib64/libexiv2.so)
Call Stack (most recent call first):
/usr/share/cmake/Modules/FindPackageHandleStandardArgs.cmake:375 (_FPHSA_FAILURE_MESSAGE)
cmake/modules/FindExiv2.cmake:73 (find_package_handle_standard_args)
CMakeLists.txt:212 (find_package)
-- Configuring incomplete, errors occurred!
See also "/home/jenkins/workspace/Extragear digikam kf5-qt5 SUSEQt5.9/build/CMakeFiles/CMakeOutput.log".
See also "/home/jenkins/workspace/Extragear digikam kf5-qt5 SUSEQt5.9/build/CMakeFiles/CMakeError.log".
[Pipeline] }
[Pipeline] // stage
[Pipeline] }
ERROR: script returned exit code 1
[Pipeline] // catchError
[Pipeline] sh
[Extragear digikam kf5-qt5 SUSEQt5.9] Running shell script
+ python3 -u ci-tooling/helpers/capture-workspace.py --environment production
[Pipeline] emailextrecipients
[Pipeline] emailext


build.log (19K) Download Attachment
12345 ... 21