CONSOLE OUTPUT
|
[...truncated 10043 lines...] |
[2021-02-25T12:45:16.860Z] [ 90%] Building CXX object core/tests/multithreading/CMakeFiles/multicorerawtopng.dir/myactionthread.cpp.o |
[2021-02-25T12:45:16.860Z] [ 90%] Automatic MOC for target panoparser_test |
[2021-02-25T12:45:16.860Z] Scanning dependencies of target searchtextbartest |
[2021-02-25T12:45:17.141Z] [ 90%] Building CXX object core/tests/widgets/CMakeFiles/searchtextbartest.dir/searchtextbartest_autogen/mocs_compilation.cpp.o |
[2021-02-25T12:45:17.141Z] [ 90%] Building CXX object core/tests/widgets/CMakeFiles/searchtextbartest.dir/searchtextbartest.cpp.o |
[2021-02-25T12:45:17.141Z] [ 90%] Linking CXX executable raw2png |
[2021-02-25T12:45:17.424Z] [ 90%] Built target panoparser_test_autogen |
[2021-02-25T12:45:17.424Z] Scanning dependencies of target digikamgui_autogen |
[2021-02-25T12:45:17.424Z] [ 90%] Automatic MOC for target digikamgui |
[2021-02-25T12:45:17.424Z] Scanning dependencies of target sialis |
[2021-02-25T12:45:17.424Z] [ 90%] Building CXX object core/tests/webservices/o2/sialis/CMakeFiles/sialis.dir/sialis_autogen/mocs_compilation.cpp.o |
[2021-02-25T12:45:17.692Z] [ 90%] Building CXX object core/tests/webservices/o2/sialis/CMakeFiles/sialis.dir/__/__/__/__/libs/dplugins/webservices/o2/examples/sialis/tweetmodel.cpp.o |
[2021-02-25T12:45:17.692Z] [ 90%] Built target raw2png |
[2021-02-25T12:45:17.692Z] Scanning dependencies of target Generic_MediaServer_Plugin_autogen |
[2021-02-25T12:45:17.692Z] [ 90%] Automatic MOC for target Generic_MediaServer_Plugin |
[2021-02-25T12:45:17.977Z] [ 90%] Built target digikamgui_autogen |
[2021-02-25T12:45:17.977Z] Scanning dependencies of target Generic_Panorama_Plugin_autogen |
[2021-02-25T12:45:17.977Z] [ 90%] Automatic MOC for target Generic_Panorama_Plugin |
[2021-02-25T12:45:18.258Z] Scanning dependencies of target ditemslisttest |
[2021-02-25T12:45:18.258Z] [ 90%] Building CXX object core/tests/widgets/CMakeFiles/ditemslisttest.dir/ditemslisttest_autogen/mocs_compilation.cpp.o |
[2021-02-25T12:45:18.836Z] [ 90%] Building CXX object core/tests/webservices/o2/sialis/CMakeFiles/sialis.dir/__/__/__/__/libs/dplugins/webservices/o2/examples/sialis/twitterapi.cpp.o |
[2021-02-25T12:45:19.100Z] [ 90%] Building CXX object core/tests/webservices/o2/fbdemo/CMakeFiles/fbdemo.dir/__/__/__/__/libs/dplugins/webservices/o2/examples/facebookdemo/fbdemo.cpp.o |
[2021-02-25T12:45:20.563Z] [ 90%] Building CXX object core/tests/webservices/o2/twdemo/CMakeFiles/twdemo.dir/__/__/__/__/libs/dplugins/webservices/o2/examples/twitterdemo/tweeter.cpp.o |
[2021-02-25T12:45:21.548Z] [ 90%] Building CXX object core/tests/webservices/o2/sialis/CMakeFiles/sialis.dir/__/__/__/__/libs/dplugins/webservices/o2/examples/sialis/main.cpp.o |
[2021-02-25T12:45:21.825Z] [ 90%] Building CXX object core/tests/webservices/o2/twdemo/CMakeFiles/twdemo.dir/__/__/__/__/libs/dplugins/webservices/o2/examples/twitterdemo/main.cpp.o |
[2021-02-25T12:45:22.425Z] [ 90%] Built target timestampupdatetest_autogen |
[2021-02-25T12:45:22.425Z] [ 90%] Building CXX object core/tests/widgets/CMakeFiles/ditemslisttest.dir/ditemslisttest.cpp.o |
[2021-02-25T12:45:22.425Z] [ 90%] Building CXX object core/tests/webservices/o2/fbdemo/CMakeFiles/fbdemo.dir/__/__/__/__/libs/dplugins/webservices/o2/examples/facebookdemo/main.cpp.o |
[2021-02-25T12:45:22.425Z] [ 90%] Linking CXX executable multicorerawtopng |
[2021-02-25T12:45:23.024Z] [ 90%] Built target multicorerawtopng |
[2021-02-25T12:45:23.608Z] [ 90%] Linking CXX executable searchtextbartest |
[2021-02-25T12:45:23.870Z] [ 90%] Built target searchtextbartest |
[2021-02-25T12:45:25.791Z] Scanning dependencies of target filemediaserver |
[2021-02-25T12:45:25.791Z] [ 90%] Building CXX object core/tests/mediaserver/CMakeFiles/filemediaserver.dir/filemediaserver_autogen/mocs_compilation.cpp.o |
[2021-02-25T12:45:25.791Z] [ 90%] Building CXX object core/tests/mediaserver/CMakeFiles/filemediaserver.dir/__/__/dplugins/generic/tools/mediaserver/upnpsdk/Platinum/Source/Tests/FileMediaServer/FileMediaServerTest.cpp.o |
[2021-02-25T12:45:26.061Z] Scanning dependencies of target testnrestimate |
[2021-02-25T12:45:26.061Z] [ 90%] Building CXX object core/tests/filters/CMakeFiles/testnrestimate.dir/testnrestimate_autogen/mocs_compilation.cpp.o |
[2021-02-25T12:45:26.323Z] [ 90%] Building CXX object core/tests/filters/CMakeFiles/testnrestimate.dir/testnrestimate.cpp.o |
[2021-02-25T12:45:27.292Z] Scanning dependencies of target filesaveoptionsboxtest |
[2021-02-25T12:45:27.292Z] [ 90%] Building CXX object core/tests/fileio/CMakeFiles/filesaveoptionsboxtest.dir/filesaveoptionsboxtest_autogen/mocs_compilation.cpp.o |
[2021-02-25T12:45:27.895Z] [ 90%] Linking CXX executable filemediaserver |
[2021-02-25T12:45:28.179Z] [ 90%] Built target filemediaserver |
[2021-02-25T12:45:28.179Z] [ 90%] Building CXX object core/tests/fileio/CMakeFiles/filesaveoptionsboxtest.dir/filesaveoptionsboxtest.cpp.o |
[2021-02-25T12:45:29.601Z] [ 90%] Linking CXX executable twdemo |
[2021-02-25T12:45:29.601Z] Scanning dependencies of target dmediaservertest |
[2021-02-25T12:45:29.601Z] [ 90%] Building CXX object core/tests/mediaserver/CMakeFiles/dmediaservertest.dir/dmediaservertest_autogen/mocs_compilation.cpp.o |
[2021-02-25T12:45:29.601Z] [ 90%] Built target twdemo |
[2021-02-25T12:45:29.601Z] [ 90%] Building CXX object core/tests/mediaserver/CMakeFiles/dmediaservertest.dir/dmediaserver_test.cpp.o |
[2021-02-25T12:45:29.873Z] [ 90%] Linking CXX executable fbdemo |
[2021-02-25T12:45:30.141Z] [ 90%] Built target fbdemo |
[2021-02-25T12:45:30.141Z] Scanning dependencies of target digikamgui |
[2021-02-25T12:45:30.141Z] [ 90%] Building CXX object core/app/CMakeFiles/digikamgui.dir/digikamgui_autogen/mocs_compilation.cpp.o |
[2021-02-25T12:45:30.400Z] [ 90%] Built target Generic_MediaServer_Plugin_autogen |
[2021-02-25T12:45:30.400Z] [ 90%] Linking CXX shared library libdigikamgui.so |
[2021-02-25T12:45:30.670Z] Scanning dependencies of target panoparser_test |
[2021-02-25T12:45:30.670Z] [ 91%] Building CXX object core/tests/panorama/CMakeFiles/panoparser_test.dir/panoparser_test_autogen/mocs_compilation.cpp.o |
[2021-02-25T12:45:30.939Z] [ 91%] Building CXX object core/tests/panorama/CMakeFiles/panoparser_test.dir/panoparser_test.cpp.o |
[2021-02-25T12:45:32.351Z] Scanning dependencies of target timestampupdatetest |
[2021-02-25T12:45:32.351Z] [ 91%] Building CXX object core/tests/timestampupdate/CMakeFiles/timestampupdatetest.dir/timestampupdatetest_autogen/mocs_compilation.cpp.o |
[2021-02-25T12:45:32.918Z] Scanning dependencies of target Generic_MediaServer_Plugin |
[2021-02-25T12:45:32.918Z] [ 91%] Building CXX object core/dplugins/generic/tools/mediaserver/CMakeFiles/Generic_MediaServer_Plugin.dir/Generic_MediaServer_Plugin_autogen/mocs_compilation.cpp.o |
[2021-02-25T12:45:34.304Z] [ 91%] Building CXX object core/tests/timestampupdate/CMakeFiles/timestampupdatetest.dir/timestampupdatetest.cpp.o |
[2021-02-25T12:45:35.686Z] [ 91%] Linking CXX executable ditemslisttest |
[2021-02-25T12:45:36.269Z] [ 91%] Built target ditemslisttest |
[2021-02-25T12:45:36.269Z] [ 91%] Building CXX object core/dplugins/generic/tools/mediaserver/CMakeFiles/Generic_MediaServer_Plugin.dir/dmediaserverdlg.cpp.o |
[2021-02-25T12:45:36.854Z] c++: error: unable to execute command: Killed |
[2021-02-25T12:45:36.854Z] c++: error: linker command failed due to signal (use -v to see invocation) |
[2021-02-25T12:45:36.854Z] [ 91%] Linking CXX executable testnrestimate |
[2021-02-25T12:45:36.854Z] gmake[2]: *** [core/app/CMakeFiles/digikamgui.dir/build.make:1058: core/app/libdigikamgui.so.7.2.0] Error 254 |
[2021-02-25T12:45:36.854Z] gmake[1]: *** [CMakeFiles/Makefile2:10782: core/app/CMakeFiles/digikamgui.dir/all] Error 2 |
[2021-02-25T12:45:36.854Z] gmake[1]: *** Waiting for unfinished jobs.... |
[2021-02-25T12:45:37.121Z] [ 91%] Building CXX object core/dplugins/generic/tools/mediaserver/CMakeFiles/Generic_MediaServer_Plugin.dir/mediaserverplugin.cpp.o |
[2021-02-25T12:45:37.705Z] [ 91%] Built target testnrestimate |
[2021-02-25T12:45:37.705Z] [ 91%] Linking CXX executable sialis |
[2021-02-25T12:45:37.705Z] [ 91%] Linking CXX executable dmediaservertest |
[2021-02-25T12:45:37.705Z] [ 91%] Linking CXX executable panoparser_test |
[2021-02-25T12:45:38.285Z] [ 91%] Built target panoparser_test |
[2021-02-25T12:45:38.285Z] [ 91%] Built target sialis |
[2021-02-25T12:45:38.285Z] [ 92%] Linking CXX executable filesaveoptionsboxtest |
[2021-02-25T12:45:38.552Z] [ 92%] Built target dmediaservertest |
[2021-02-25T12:45:39.121Z] [ 92%] Built target filesaveoptionsboxtest |
[2021-02-25T12:45:39.121Z] [ 92%] Built target Generic_Panorama_Plugin_autogen |
[2021-02-25T12:45:40.095Z] Scanning dependencies of target dimghistorygraphtest |
[2021-02-25T12:45:40.095Z] [ 92%] Building CXX object core/tests/dimg/CMakeFiles/dimghistorygraphtest.dir/dimghistorygraphtest_autogen/mocs_compilation.cpp.o |
[2021-02-25T12:45:40.095Z] [ 92%] Building CXX object core/tests/dimg/CMakeFiles/dimghistorygraphtest.dir/dimghistorygraphtest.cpp.o |
[2021-02-25T12:45:40.662Z] [ 92%] Linking CXX executable timestampupdatetest |
[2021-02-25T12:45:41.232Z] [ 92%] Built target timestampupdatetest |
[2021-02-25T12:45:41.232Z] [ 92%] Linking CXX shared module Generic_MediaServer_Plugin.so |
[2021-02-25T12:45:41.801Z] [ 92%] Built target Generic_MediaServer_Plugin |
[2021-02-25T12:45:49.927Z] [ 92%] Linking CXX executable dimghistorygraphtest |
[2021-02-25T12:45:50.496Z] [ 92%] Built target dimghistorygraphtest |
[2021-02-25T12:45:50.496Z] gmake: *** [Makefile:160: all] Error 2 |
[Pipeline] } |
[Pipeline] // stage |
[Pipeline] } |
[2021-02-25T12:45:50.558Z] ERROR: script returned exit code 1 |
[Pipeline] // catchError |
[Pipeline] emailextrecipients |
[Pipeline] emailext |