CONSOLE OUTPUT
|
[...truncated 10036 lines...] |
[2020-11-19T05:33:59.877Z] Scanning dependencies of target twdemo |
[2020-11-19T05:33:59.877Z] [ 88%] Building CXX object core/tests/webservices/o2/twdemo/CMakeFiles/twdemo.dir/twdemo_autogen/mocs_compilation.cpp.o |
[2020-11-19T05:34:00.469Z] Scanning dependencies of target searchtextbartest |
[2020-11-19T05:34:00.469Z] [ 88%] Building CXX object core/tests/widgets/CMakeFiles/searchtextbartest.dir/searchtextbartest_autogen/mocs_compilation.cpp.o |
[2020-11-19T05:34:00.469Z] Scanning dependencies of target ditemslisttest |
[2020-11-19T05:34:00.469Z] [ 88%] Building CXX object core/tests/widgets/CMakeFiles/ditemslisttest.dir/ditemslisttest_autogen/mocs_compilation.cpp.o |
[2020-11-19T05:34:00.734Z] Scanning dependencies of target sialis |
[2020-11-19T05:34:00.734Z] [ 88%] Building CXX object core/tests/webservices/o2/sialis/CMakeFiles/sialis.dir/sialis_autogen/mocs_compilation.cpp.o |
[2020-11-19T05:34:00.734Z] [ 88%] Building CXX object core/tests/webservices/o2/fbdemo/CMakeFiles/fbdemo.dir/__/__/__/__/libs/dplugins/webservices/o2/examples/facebookdemo/fbdemo.cpp.o |
[2020-11-19T05:34:01.319Z] [ 88%] Building CXX object core/tests/multithreading/CMakeFiles/multicorerawtopng.dir/myactionthread.cpp.o |
[2020-11-19T05:34:01.601Z] [ 88%] Building CXX object core/tests/widgets/CMakeFiles/ditemslisttest.dir/ditemslisttest.cpp.o |
[2020-11-19T05:34:01.601Z] [ 88%] Building CXX object core/tests/webservices/o2/twdemo/CMakeFiles/twdemo.dir/__/__/__/__/libs/dplugins/webservices/o2/examples/twitterdemo/tweeter.cpp.o |
[2020-11-19T05:34:01.601Z] [ 88%] Building CXX object core/tests/webservices/o2/twdemo/CMakeFiles/twdemo.dir/__/__/__/__/libs/dplugins/webservices/o2/examples/twitterdemo/main.cpp.o |
[2020-11-19T05:34:02.180Z] [ 88%] Building CXX object core/tests/widgets/CMakeFiles/searchtextbartest.dir/searchtextbartest.cpp.o |
[2020-11-19T05:34:02.180Z] [ 88%] Built target timestampupdatetest_autogen |
[2020-11-19T05:34:02.180Z] Scanning dependencies of target digikamgui_autogen |
[2020-11-19T05:34:02.180Z] Scanning dependencies of target Generic_MediaServer_Plugin_autogen |
[2020-11-19T05:34:02.180Z] [ 88%] Automatic MOC for target digikamgui |
[2020-11-19T05:34:02.180Z] [ 88%] Automatic MOC for target Generic_MediaServer_Plugin |
[2020-11-19T05:34:02.452Z] [ 88%] Built target digikamgui_autogen |
[2020-11-19T05:34:02.452Z] [ 88%] Building CXX object core/tests/webservices/o2/sialis/CMakeFiles/sialis.dir/__/__/__/__/libs/dplugins/webservices/o2/examples/sialis/tweetmodel.cpp.o |
[2020-11-19T05:34:02.452Z] [ 88%] Building CXX object core/tests/webservices/o2/sialis/CMakeFiles/sialis.dir/__/__/__/__/libs/dplugins/webservices/o2/examples/sialis/twitterapi.cpp.o |
[2020-11-19T05:34:02.452Z] [ 88%] Building CXX object core/tests/webservices/o2/fbdemo/CMakeFiles/fbdemo.dir/__/__/__/__/libs/dplugins/webservices/o2/examples/facebookdemo/main.cpp.o |
[2020-11-19T05:34:02.719Z] [ 88%] Building CXX object core/tests/webservices/o2/sialis/CMakeFiles/sialis.dir/__/__/__/__/libs/dplugins/webservices/o2/examples/sialis/main.cpp.o |
[2020-11-19T05:34:02.979Z] [ 88%] Linking CXX executable showfoto |
[2020-11-19T05:34:03.236Z] [ 88%] Built target showfoto |
[2020-11-19T05:34:03.236Z] Scanning dependencies of target Generic_Panorama_Plugin_autogen |
[2020-11-19T05:34:03.236Z] [ 88%] Automatic MOC for target Generic_Panorama_Plugin |
[2020-11-19T05:34:03.825Z] [ 88%] Linking CXX executable multicorerawtopng |
[2020-11-19T05:34:04.085Z] [ 88%] Built target multicorerawtopng |
[2020-11-19T05:34:05.028Z] [ 88%] Linking CXX executable twdemo |
[2020-11-19T05:34:05.028Z] Scanning dependencies of target filemediaserver |
[2020-11-19T05:34:05.028Z] [ 88%] Building CXX object core/tests/mediaserver/CMakeFiles/filemediaserver.dir/filemediaserver_autogen/mocs_compilation.cpp.o |
[2020-11-19T05:34:05.028Z] [ 88%] Building CXX object core/tests/mediaserver/CMakeFiles/filemediaserver.dir/__/__/dplugins/generic/tools/mediaserver/upnpsdk/Platinum/Source/Tests/FileMediaServer/FileMediaServerTest.cpp.o |
[2020-11-19T05:34:05.028Z] [ 88%] Built target twdemo |
[2020-11-19T05:34:05.287Z] [ 88%] Linking CXX executable fbdemo |
[2020-11-19T05:34:05.546Z] [ 88%] Linking CXX executable searchtextbartest |
[2020-11-19T05:34:05.546Z] Scanning dependencies of target testnrestimate |
[2020-11-19T05:34:05.546Z] [ 88%] Building CXX object core/tests/filters/CMakeFiles/testnrestimate.dir/testnrestimate_autogen/mocs_compilation.cpp.o |
[2020-11-19T05:34:05.546Z] [ 88%] Building CXX object core/tests/filters/CMakeFiles/testnrestimate.dir/testnrestimate.cpp.o |
[2020-11-19T05:34:05.546Z] [ 88%] Built target searchtextbartest |
[2020-11-19T05:34:05.546Z] [ 88%] Built target fbdemo |
[2020-11-19T05:34:05.808Z] Scanning dependencies of target digikamgui |
[2020-11-19T05:34:05.808Z] [ 88%] Building CXX object core/app/CMakeFiles/digikamgui.dir/digikamgui_autogen/mocs_compilation.cpp.o |
[2020-11-19T05:34:05.808Z] [ 88%] Linking CXX executable ditemslisttest |
[2020-11-19T05:34:05.808Z] [ 88%] Linking CXX shared library libdigikamgui.so |
[2020-11-19T05:34:05.808Z] [ 88%] Built target ditemslisttest |
[2020-11-19T05:34:06.069Z] [ 88%] Linking CXX executable filemediaserver |
[2020-11-19T05:34:06.341Z] Scanning dependencies of target filesaveoptionsboxtest |
[2020-11-19T05:34:06.341Z] [ 88%] Building CXX object core/tests/fileio/CMakeFiles/filesaveoptionsboxtest.dir/filesaveoptionsboxtest_autogen/mocs_compilation.cpp.o |
[2020-11-19T05:34:06.341Z] [ 88%] Building CXX object core/tests/fileio/CMakeFiles/filesaveoptionsboxtest.dir/filesaveoptionsboxtest.cpp.o |
[2020-11-19T05:34:06.341Z] [ 88%] Built target filemediaserver |
[2020-11-19T05:34:06.600Z] Scanning dependencies of target dmediaservertest |
[2020-11-19T05:34:06.600Z] [ 88%] Building CXX object core/tests/mediaserver/CMakeFiles/dmediaservertest.dir/dmediaserver_test.cpp.o |
[2020-11-19T05:34:06.600Z] [ 88%] Building CXX object core/tests/mediaserver/CMakeFiles/dmediaservertest.dir/dmediaservertest_autogen/mocs_compilation.cpp.o |
[2020-11-19T05:34:07.184Z] Scanning dependencies of target panoparser_test |
[2020-11-19T05:34:07.184Z] [ 88%] Building CXX object core/tests/panorama/CMakeFiles/panoparser_test.dir/panoparser_test_autogen/mocs_compilation.cpp.o |
[2020-11-19T05:34:07.184Z] [ 88%] Building CXX object core/tests/panorama/CMakeFiles/panoparser_test.dir/panoparser_test.cpp.o |
[2020-11-19T05:34:08.137Z] [ 88%] Built target Generic_MediaServer_Plugin_autogen |
[2020-11-19T05:34:08.706Z] c++: error: unable to execute command: Killed |
[2020-11-19T05:34:08.706Z] c++: error: linker command failed due to signal (use -v to see invocation) |
[2020-11-19T05:34:08.706Z] Scanning dependencies of target timestampupdatetest |
[2020-11-19T05:34:08.706Z] gmake[2]: *** [core/app/CMakeFiles/digikamgui.dir/build.make:1059: core/app/libdigikamgui.so.7.2.0] Error 254 |
[2020-11-19T05:34:08.706Z] gmake[1]: *** [CMakeFiles/Makefile2:10752: core/app/CMakeFiles/digikamgui.dir/all] Error 2 |
[2020-11-19T05:34:08.706Z] gmake[1]: *** Waiting for unfinished jobs.... |
[2020-11-19T05:34:08.706Z] [ 88%] Building CXX object core/tests/timestampupdate/CMakeFiles/timestampupdatetest.dir/timestampupdatetest.cpp.o |
[2020-11-19T05:34:08.706Z] [ 88%] Building CXX object core/tests/timestampupdate/CMakeFiles/timestampupdatetest.dir/timestampupdatetest_autogen/mocs_compilation.cpp.o |
[2020-11-19T05:34:10.630Z] Scanning dependencies of target Generic_MediaServer_Plugin |
[2020-11-19T05:34:10.630Z] [ 89%] Building CXX object core/dplugins/generic/tools/mediaserver/CMakeFiles/Generic_MediaServer_Plugin.dir/Generic_MediaServer_Plugin_autogen/mocs_compilation.cpp.o |
[2020-11-19T05:34:10.631Z] [ 89%] Building CXX object core/dplugins/generic/tools/mediaserver/CMakeFiles/Generic_MediaServer_Plugin.dir/dmediaserverdlg.cpp.o |
[2020-11-19T05:34:10.631Z] [ 89%] Building CXX object core/dplugins/generic/tools/mediaserver/CMakeFiles/Generic_MediaServer_Plugin.dir/mediaserverplugin.cpp.o |
[2020-11-19T05:34:10.631Z] [ 89%] Linking CXX executable sialis |
[2020-11-19T05:34:10.631Z] [ 89%] Built target sialis |
[2020-11-19T05:34:10.631Z] [ 89%] Linking CXX executable panoparser_test |
[2020-11-19T05:34:10.631Z] [ 89%] Built target panoparser_test |
[2020-11-19T05:34:10.901Z] [ 89%] Linking CXX executable testnrestimate |
[2020-11-19T05:34:10.901Z] [ 89%] Linking CXX executable dmediaservertest |
[2020-11-19T05:34:10.901Z] [ 89%] Built target testnrestimate |
[2020-11-19T05:34:11.161Z] [ 89%] Built target dmediaservertest |
[2020-11-19T05:34:11.444Z] [ 89%] Linking CXX executable filesaveoptionsboxtest |
[2020-11-19T05:34:11.444Z] [ 89%] Built target filesaveoptionsboxtest |
[2020-11-19T05:34:12.385Z] [ 89%] Built target Generic_Panorama_Plugin_autogen |
[2020-11-19T05:34:12.954Z] [ 89%] Linking CXX shared module Generic_MediaServer_Plugin.so |
[2020-11-19T05:34:12.954Z] [ 89%] Linking CXX executable timestampupdatetest |
[2020-11-19T05:34:13.213Z] [ 89%] Built target timestampupdatetest |
[2020-11-19T05:34:13.213Z] [ 89%] Built target Generic_MediaServer_Plugin |
[2020-11-19T05:34:14.147Z] Scanning dependencies of target dimghistorygraphtest |
[2020-11-19T05:34:14.147Z] [ 89%] Building CXX object core/tests/dimg/CMakeFiles/dimghistorygraphtest.dir/dimghistorygraphtest_autogen/mocs_compilation.cpp.o |
[2020-11-19T05:34:14.405Z] [ 89%] Building CXX object core/tests/dimg/CMakeFiles/dimghistorygraphtest.dir/dimghistorygraphtest.cpp.o |
[2020-11-19T05:34:27.483Z] [ 89%] Linking CXX executable dimghistorygraphtest |
[2020-11-19T05:34:27.483Z] [ 89%] Built target dimghistorygraphtest |
[2020-11-19T05:34:27.483Z] gmake: *** [Makefile:161: all] Error 2 |
[Pipeline] } |
[Pipeline] // stage |
[Pipeline] } |
[2020-11-19T05:34:27.686Z] ERROR: script returned exit code 1 |
[Pipeline] // catchError |
[Pipeline] emailextrecipients |
[Pipeline] emailext |